{"text_format":"1","workbook":"xlsx","n_sheets":14,"sheets":["Sheet1","小口精算シート","部課コード","小口精算入力シート_サブ","マスタ関連","DEN","経費科目","【経理使用】小口現金一覧","BI","BTIN","TBL","入力","Module1","Sheet2"],"not_rendered":{"charts":0,"images":4,"macros":1,"external_links":0,"defined_names":6,"comments":0,"pivot_tables":0},"unopened":[{"sheet":"Module1","index":12,"reason":"part_missing"}],"bounds":{"document_bytes":16777216,"sheet_cells":100000,"rows_first":2000,"rows_last":500,"rows_between":2000,"halvings":0,"cell_chars":16384,"cell_head_chars":4096},"cells_cut":0,"cells_raw":0,"read":"whole","date_system":"1900"}

{"sheet":"Sheet1","index":0,"n_rows":43,"n_cols":8,"rows_kept":43,"cut":false,"hidden":true,"merged":[[2,7,10,7],[11,7,42,7],[0,0,1,0],[2,4,9,4],[0,1,1,1],[10,4,38,4]]}
["№","列","Ｒ　　Ｍ　　標　　準",null,null,"日　新　バ　ー　ジ　ョ　ン"]
[null,null,"項　目　名　称","項　目　名","分類","項　目　名　称","項　目　名","分類"]
[1,"A","伝票日付","BLDAT","ヘッダ","伝票日付","BLDAT","ヘッダ"]
[2,"B","会社ｺｰﾄﾞ","BUKRS",null,"伝票タイプ","BUKRS"]
[3,"C","転記日付","BUDAT",null,"会社コード","BUDAT"]
[4,"D","伝票ﾀｲﾌﾟ","BLART",null,"転記日付","BLART"]
[5,"E","通貨ｺｰﾄﾞ","WAERS",null,"通貨コード","WAERS"]
[6,"F","ヘッダテキスト","BKTXT",null,"換算レート","KURSF"]
[7,"G","参照伝票番号","XBLNR",null,"参照伝票番号","XBLNR"]
[8,"H","税自動計算","XMWST",null,"ヘッダテキスト","BKTXT"]
[9,"I","転記ｷｰ","NEWBS","明　　　　　　　　　細","税自動計算","XMWST"]
[10,"J","勘定ｺｰﾄﾞ","NEWKO",null,"転記キー","NEWBS","明　　　　　　　　　細"]
[11,"K","特殊GL","NEWUM",null,"勘定コード","NEWKO"]
[12,"L","金額","WRBTR",null,"特殊GL","NEWUM"]
[13,"M","税ｺｰﾄﾞ","MWSKZ",null,"金額","WRBTR"]
{"$rows_left_out":29}
{"sheet":"小口精算シート","index":1,"n_rows":166,"n_cols":9,"rows_kept":166,"cut":false,"hidden":false,"merged":[[156,3,156,4],[157,3,157,4],[158,3,158,4],[159,3,159,4],[160,3,160,4],[161,3,161,4],[162,3,162,4],[163,3,163,4],[147,3,147,4],[148,3,148,4],[149,3,149,4],[150,3,150,4],[151,3,151,4],[152,3,152,4],[153,3,153,4],[154,3,154,4],[155,3,155,4],[138,3,138,4],[139,3,139,4],[140,3,140,4],[141,3,141,4],[142,3,142,4],[143,3,143,4],[144,3,144,4],[145,3,145,4],[146,3,146,4],[129,3,129,4],[130,3,130,4],[131,3,131,4],[132,3,132,4],[133,3,133,4],[134,3,134,4],[135,3,135,4],[136,3,136,4],[137,3,137,4],[120,3,120,4],[121,3,121,4],[122,3,122,4],[123,3,123,4],[124,3,124,4],[125,3,125,4],[126,3,126,4],[127,3,127,4],[128,3,128,4],[112,3,112,4],[113,3,113,4],[97,3,97,4],[98,3,98,4],[99,3,99,4],[100,3,100,4],[165,1,165,8],[103,3,103,4],[104,3,104,4],[105,3,105,4],[106,3,106,4],[107,3,107,4],[108,3,108,4],[109,3,109,4],[110,3,110,4],[111,3,111,4],[101,3,101,4],[102,3,102,4],[114,3,114,4],[115,3,115,4],[116,3,116,4],[117,3,117,4],[118,3,118,4],[119,3,119,4],[91,3,91,4],[92,3,92,4],[93,3,93,4],[94,3,94,4],[95,3,95,4],[96,3,96,4],[85,3,85,4],[86,3,86,4],[87,3,87,4],[88,3,88,4],[89,3,89,4],[90,3,90,4],[79,3,79,4],[80,3,80,4],[81,3,81,4],[82,3,82,4],[83,3,83,4],[84,3,84,4],[73,3,73,4],[74,3,74,4],[75,3,75,4],[76,3,76,4],[77,3,77,4],[78,3,78,4],[67,3,67,4],[68,3,68,4],[69,3,69,4],[70,3,70,4],[71,3,71,4],[72,3,72,4],[61,3,61,4],[62,3,62,4],[63,3,63,4],[64,3,64,4],[65,3,65,4],[66,3,66,4],[55,3,55,4],[56,3,56,4],[57,3,57,4],[58,3,58,4],[59,3,59,4],[60,3,60,4],[49,3,49,4],[50,3,50,4],[51,3,51,4],[52,3,52,4],[53,3,53,4],[54,3,54,4],[43,3,43,4],[44,3,44,4],[45,3,45,4],[46,3,46,4],[47,3,47,4],[48,3,48,4],[37,3,37,4],[38,3,38,4],[39,3,39,4],[40,3,40,4],[41,3,41,4],[42,3,42,4],[31,3,31,4],[32,3,32,4],[33,3,33,4],[34,3,34,4],[35,3,35,4],[36,3,36,4],[25,3,25,4],[26,3,26,4],[27,3,27,4],[28,3,28,4],[29,3,29,4],[30,3,30,4],[19,3,19,4],[20,3,20,4],[21,3,21,4],[22,3,22,4],[23,3,23,4],[24,3,24,4],[10,3,10,4],[14,3,14,4],[13,3,13,4],[18,3,18,4],[17,3,17,4],[16,3,16,4],[15,3,15,4],[12,1,12,8],[10,6,10,7],[0,1,0,8],[10,1,10,2],[6,1,6,2],[7,1,7,2],[8,1,8,2],[7,6,8,7],[4,3,4,4],[5,3,5,4],[7,3,7,4],[8,3,8,4],[2,1,2,2],[3,1,3,2],[5,1,5,2],[4,1,4,2],[6,6,6,7],[6,5,8,5],[2,3,2,4],[3,3,3,4],[2,5,5,7]]}
[null,"小口現金精算表"]
[]
[null,"作成日",null,{"$f":"NOW()","v":"2023-05-02T10:13:47.900"},null,"　【注意】\n　　□青色セルのみ入力してください。\n　　□部課コードは４桁で入力してください。（0XXX）\n　　□行・列の挿入はしないでください。\n　　□経理部使用欄は実行しないで下さい。"]
[null,"部課名称",null,{"$f":"IF(D7=\"\",\"\",VLOOKUP(D7,【経理使用】小口現金一覧!$A4:$D70,2,0))","v":""}]
[null,"課長名"]
[null,"担当者名"]
[null,"小口設定部課コード",null,null,{"$f":"IFERROR(VLOOKUP(\"NS-\"&D7,部課コード!$A$3:$E$457,5,0),\"\")","v":0},"小口設定科目",{"$f":"IF(D7=\"\",\"\",VLOOKUP(D7,【経理使用】小口現金一覧!$A4:$E38,3,0))","v":""}]
[null,"設定額",null,{"$f":"IF(D7=\"\",\"\",VLOOKUP(D7,【経理使用】小口現金一覧!$A4:$E38,5,0))","v":""},null,null,{"$f":"IF(D7=\"\",\"\",VLOOKUP(D7,【経理使用】小口現金一覧!$A4:$E38,4,0))","v":""}]
[null,"使用額（補充額）",null,{"$f":"SUM(F15:F164)","v":0}]
[]
[null,"転記日(会計入力）",null,null,null,"伝票NO (会計入力）"]
[]
[null,"使　用　明　細"]
[null,"NO","勘定科目コード","勘定科目名称",null,"金額","税区分","部課","摘要"]
[null,{"$f":"IF(C15=\"\",\"\",1)","v":""},null,{"$f":"IF(C15=\"\",\"\",VLOOKUP(C15,経費科目!$A$3:$B$77,2,0))","v":""}]
{"$rows_left_out":152}
{"sheet":"部課コード","index":2,"n_rows":457,"n_cols":5,"rows_kept":457,"cut":false,"hidden":true,"merged":[]}
[]
[null,10,"本社"]
[{"$f":"\"NS-\"&B3","v":"NS-0100"},"0100","本社　本社","管理","NS00"]
["NS-0101","0101","本社　役員","管理","NS00"]
["NS-0102","0102","本社　執行役員","管理","NS00"]
["NS-0105","0105","本社　弁護士・会計士","管理","NS00"]
["NS-0106","0106","本社　人件費管理","管理","NS00"]
["NS-0109","0109","本社　全社・経費","管理","NS00"]
["NS-0182","0182","本社　浅間台家族寮","管理","NS00"]
["NS-0183","0183","本社　浅間台独身寮","管理","NS00"]
["NS-0188","0188","本社　白浜荘","管理","NS00"]
["NS-0189","0189","本社　女子独身寮","管理","NS00"]
["NS-0191","0191","本社　出向・国内","管理","NS00"]
["NS-0193","0193","本社　顧問・嘱託","管理","NS00"]
["NS-0194","0194","本社　長期療養者","管理","NS00"]
{"$rows_left_out":443}
{"sheet":"小口精算入力シート_サブ","index":3,"n_rows":156,"n_cols":5,"rows_kept":156,"cut":false,"hidden":true,"merged":[]}
["小口精算シート補助用シート"]
["事業領域・税区分参照用"]
["※パスワード無保護必須"]
[]
["NO","部課CD","事業領域","税区分","税区分変換"]
[{"$f":"IF(小口精算シート!B15<>\"\",小口精算シート!B15,\"\")","v":""},{"$f":"IF(小口精算シート!H15<>\"\",小口精算シート!H15,\"\")","v":""},{"$f":"IF(B6=\"\",\"\",VLOOKUP(\"NS-\"&B6,部課コード!$A$3:$E$457,5,0))","v":""},{"$f":"IF(小口精算シート!G15<>\"\",小口精算シート!G15,\"\")","v":""},{"$f":"IF(D6<>\"\",VLOOKUP(D6,マスタ関連!$A$5:$B$11,2,FALSE),\"\")","v":""}]
[{"$f":"IF(小口精算シート!B16<>\"\",小口精算シート!B16,\"\")","v":""},{"$f":"IF(小口精算シート!H16<>\"\",小口精算シート!H16,\"\")","v":""},{"$f":"IF(B7=\"\",\"\",VLOOKUP(\"NS-\"&B7,部課コード!$A$3:$E$457,5,0))","v":""},{"$f":"IF(小口精算シート!G16<>\"\",小口精算シート!G16,\"\")","v":""},{"$f":"IF(D7<>\"\",VLOOKUP(D7,マスタ関連!$A$5:$B$11,2,FALSE),\"\")","v":""}]
[{"$f":"IF(小口精算シート!B17<>\"\",小口精算シート!B17,\"\")","v":""},{"$f":"IF(小口精算シート!H17<>\"\",小口精算シート!H17,\"\")","v":""},{"$f":"IF(B8=\"\",\"\",VLOOKUP(\"NS-\"&B8,部課コード!$A$3:$E$457,5,0))","v":""},{"$f":"IF(小口精算シート!G17<>\"\",小口精算シート!G17,\"\")","v":""},{"$f":"IF(D8<>\"\",VLOOKUP(D8,マスタ関連!$A$5:$B$11,2,FALSE),\"\")","v":""}]
[{"$f":"IF(小口精算シート!B18<>\"\",小口精算シート!B18,\"\")","v":""},{"$f":"IF(小口精算シート!H18<>\"\",小口精算シート!H18,\"\")","v":""},{"$f":"IF(B9=\"\",\"\",VLOOKUP(\"NS-\"&B9,部課コード!$A$3:$E$457,5,0))","v":""},{"$f":"IF(小口精算シート!G18<>\"\",小口精算シート!G18,\"\")","v":""},{"$f":"IF(D9<>\"\",VLOOKUP(D9,マスタ関連!$A$5:$B$11,2,FALSE),\"\")","v":""}]
[{"$f":"IF(小口精算シート!B19<>\"\",小口精算シート!B19,\"\")","v":""},{"$f":"IF(小口精算シート!H19<>\"\",小口精算シート!H19,\"\")","v":""},{"$f":"IF(B10=\"\",\"\",VLOOKUP(\"NS-\"&B10,部課コード!$A$3:$E$457,5,0))","v":""},{"$f":"IF(小口精算シート!G19<>\"\",小口精算シート!G19,\"\")","v":""},{"$f":"IF(D10<>\"\",VLOOKUP(D10,マスタ関連!$A$5:$B$11,2,FALSE),\"\")","v":""}]
[{"$f":"IF(小口精算シート!B20<>\"\",小口精算シート!B20,\"\")","v":""},{"$f":"IF(小口精算シート!H20<>\"\",小口精算シート!H20,\"\")","v":""},{"$f":"IF(B11=\"\",\"\",VLOOKUP(\"NS-\"&B11,部課コード!$A$3:$E$457,5,0))","v":""},{"$f":"IF(小口精算シート!G20<>\"\",小口精算シート!G20,\"\")","v":""},{"$f":"IF(D11<>\"\",VLOOKUP(D11,マスタ関連!$A$5:$B$11,2,FALSE),\"\")","v":""}]
[{"$f":"IF(小口精算シート!B21<>\"\",小口精算シート!B21,\"\")","v":""},{"$f":"IF(小口精算シート!H21<>\"\",小口精算シート!H21,\"\")","v":""},{"$f":"IF(B12=\"\",\"\",VLOOKUP(\"NS-\"&B12,部課コード!$A$3:$E$457,5,0))","v":""},{"$f":"IF(小口精算シート!G21<>\"\",小口精算シート!G21,\"\")","v":""},{"$f":"IF(D12<>\"\",VLOOKUP(D12,マスタ関連!$A$5:$B$11,2,FALSE),\"\")","v":""}]
[{"$f":"IF(小口精算シート!B22<>\"\",小口精算シート!B22,\"\")","v":""},{"$f":"IF(小口精算シート!H22<>\"\",小口精算シート!H22,\"\")","v":""},{"$f":"IF(B13=\"\",\"\",VLOOKUP(\"NS-\"&B13,部課コード!$A$3:$E$457,5,0))","v":""},{"$f":"IF(小口精算シート!G22<>\"\",小口精算シート!G22,\"\")","v":""},{"$f":"IF(D13<>\"\",VLOOKUP(D13,マスタ関連!$A$5:$B$11,2,FALSE),\"\")","v":""}]
[{"$f":"IF(小口精算シート!B23<>\"\",小口精算シート!B23,\"\")","v":""},{"$f":"IF(小口精算シート!H23<>\"\",小口精算シート!H23,\"\")","v":""},{"$f":"IF(B14=\"\",\"\",VLOOKUP(\"NS-\"&B14,部課コード!$A$3:$E$457,5,0))","v":""},{"$f":"IF(小口精算シート!G23<>\"\",小口精算シート!G23,\"\")","v":""},{"$f":"IF(D14<>\"\",VLOOKUP(D14,マスタ関連!$A$5:$B$11,2,FALSE),\"\")","v":""}]
[{"$f":"IF(小口精算シート!B24<>\"\",小口精算シート!B24,\"\")","v":""},{"$f":"IF(小口精算シート!H24<>\"\",小口精算シート!H24,\"\")","v":""},{"$f":"IF(B15=\"\",\"\",VLOOKUP(\"NS-\"&B15,部課コード!$A$3:$E$457,5,0))","v":""},{"$f":"IF(小口精算シート!G24<>\"\",小口精算シート!G24,\"\")","v":""},{"$f":"IF(D15<>\"\",VLOOKUP(D15,マスタ関連!$A$5:$B$11,2,FALSE),\"\")","v":""}]
{"$rows_left_out":142}
{"sheet":"マスタ関連","index":4,"n_rows":11,"n_cols":3,"rows_kept":11,"cut":false,"hidden":true,"merged":[]}
["マスタ関連管理用"]
[]
["税区分マスタ"]
["税区分","コード"]
["課税5%","A5"]
["課税8%","A8"]
["課税軽減8%","K8"]
["課税10%","AA"]
["非課税","A0"]
["免税","A9"]
["対象外"," ","※半角ｽﾍﾟｰｽ1文字"]

{"sheet":"DEN","index":5,"n_rows":154,"n_cols":41,"rows_kept":154,"cut":false,"hidden":false,"merged":[]}
[null,null,"X","　←　“X”を入力し、バッチインプットの処理モードを“E”で実行すると伝票概要画面で止まり、確認することが出来る"]
["伝票日付","会社","転記日付","伝票ﾀｲﾌﾟ","通貨ｺｰﾄﾞ","換算ﾚｰﾄ","参照伝票番号","ヘッダテキスト","税自動計算","転記ｷｰ","勘定コード","特殊GL","金額","国内通貨額","税ｺｰﾄﾞ","事業領域","原価センタ","利益センタ","ソートキー","明細テキスト","起算日","期日","振出日","支払方法","支払保留","取引先銀行","取引銀行","中央銀行CD","数量","数量単位","指図書","ＷＢＳ","得意先ｺｰﾄﾞ","品目ｺｰﾄﾞ","販売組織","流通ﾁｬﾈﾙ","製品部門","品目ｸﾞﾙｰﾌﾟ","営業所","営業グループ","需要家"]
["eof","","","","",null,null,"","","","",null,"",null,null,"",null,null,"",""]
[null,null,null,null,null,null,null,null,null,"40",352910,null,200,null,"","NS03","NS-0418",null,"",""]
[null,null,null,null,null,null,null,null,null,"40",148100,null,500,null,"","NS00","NS-0101",null,"",""]
[null,null,null,null,null,null,null,null,null,"","",null,"",null,"","","",null,"",""]
[null,null,null,null,null,null,null,null,null,"","",null,"",null,"","","",null,"",""]
[null,null,null,null,null,null,null,null,null,"","",null,"",null,"","","",null,"",""]
[null,null,null,null,null,null,null,null,null,"","",null,"",null,"","","",null,"",""]
[null,null,null,null,null,null,null,null,null,"","",null,"",null,"","","",null,"",""]
[null,null,null,null,null,null,null,null,null,"","",null,"",null,"","","",null,"",""]
[null,null,null,null,null,null,null,null,null,"","",null,"",null,"","","",null,"",""]
[null,null,null,null,null,null,null,null,null,"","",null,"",null,"","","",null,"",""]
[null,null,null,null,null,null,null,null,null,"","",null,"",null,"","","",null,"",""]
[null,null,null,null,null,null,null,null,null,"","",null,"",null,"","","",null,"",""]
{"$rows_left_out":140}
{"sheet":"経費科目","index":6,"n_rows":77,"n_cols":27,"rows_kept":77,"cut":false,"hidden":false,"merged":[]}
[null,null,null,null,null,null,null,null,null,null,null,null,null,null,null,null,null,null,null,null,null,"　","2008年06月23日作成"]
["勘定コード","テキスト短","テキスト長","グループ勘定コード","貸借","損益","勘定G","通貨","国内通貨","税ｶﾃｺﾞﾘ","税無","統制AC","未決済","明細照会","ｿｰﾄｷｰ","項目S","自動仕訳","追加可","計画","資金収支","資金計画","銀行ID","口座ID","項目例"]
[148100,"仮払金"]
[142102,"前払金",null,null,null,null,null,null,null,null,null,null,null,null,null,null,null,null,null,null,null,null,null,null,null,"※","各部店で必要に応じて項目例を入力して、"]
[351000,"売上原価","売上原価",5530,null,"X","ERG.","JPY",null,"-","X",null,null,"X",8,"G004",null,null,null,null,null,null,null,null,null,null,"本シートをマニュアルとして使用できるようにしてください。"]
[351011,"原価-海貨(輸出)","売上原価－海貨(輸出)",5530,null,"X","ERG.","JPY",null,"-","X",null,null,"X",8,"G004"]
[351012,"原価-海貨(輸入)","売上原価－海貨(輸入)",5530,null,"X","ERG.","JPY",null,"-","X",null,null,"X",8,"G004"]
[351013,"原価-海貨(原価差額）","売上原価－海貨(原価差額）",5530,null,"X","ERG.","JPY",null,"-","X",null,null,"X",8,"G004"]
[351021,"原価-NVOCC(輸出)","売上原価－ＮＶＯＣＣ(輸出)",5530,null,"X","ERG.","JPY",null,"-","X",null,null,"X",8,"G004"]
[351022,"原価-NVOCC(輸入)","売上原価－ＮＶＯＣＣ(輸入)",5530,null,"X","ERG.","JPY",null,"-","X",null,null,"X",8,"G004"]
[148101,"仮払金-労務費","売上原価－ＮＶＯＣＣ(原価差額）",5530,null,"X","ERG.","JPY",null,"-","X",null,null,"X",8,"G004"]
[861000,"受取利息","売上原価－航空混載(輸出)",5530,null,"X","ERG.","JPY",null,"-","X",null,null,"X",8,"G004"]
[127401,"貯蔵品","売上原価－航空混載(原価差額）",5530,null,"X","ERG.","JPY",null,"-","X",null,null,"X",8,"G004"]
[351031,"原価-航空混載(輸出)","売上原価－航空混載(輸出)",5530,null,"X","ERG.","JPY",null,"-","X",null,null,"X",8,"G004"]
[351032,"原価-航空混載(輸入)","売上原価－航空混載(輸入)",5530,null,"X","ERG.","JPY",null,"-","X",null,null,"X",8,"G004"]
{"$rows_left_out":63}
{"sheet":"【経理使用】小口現金一覧","index":7,"n_rows":62,"n_cols":8,"rows_kept":62,"cut":false,"hidden":true,"merged":[[49,1,50,1],[49,2,50,2],[49,3,50,3],[49,4,50,4]]}
["関東"]
[]
["部課コ－ド","部課名称","勘定コード","勘定科目名称","設定金額"]
["0120","秘書室（横浜）",100020,"小口現金",150000]
["0150","秘書室（東京）",100020,"小口現金",300000,null,"※","使用部課、銀行口座、設定金額等に変更があった場合には、"]
["0183","日新浅間台寮",105560,"三井住友-普通(横浜駅",250000,null,null,"適宜、本シートを更新して使用すること。（2019.10佐藤）"]
["0233","総合営業第三部　東扇島営業所",109350,"湘南信用-普通(浅田2)",100000]
["0253","陸運事業室　運輸課","109251","川崎信用-普通(小田)",150000]
["0270","国際営業第一部　本部",100020,"小口現金",50000]
["0280","海貨事業室 (本牧)",109550,"横浜-普通預金(本牧)",900000]
["0283","海貨事業室 輸送課 (大井)",106110,"みずほ-普通(大田市１",500000]
["0285","京浜支店　TLC",108700,"りそな-普通(品川）　",100000]
["0320","港運部　代理店課","109866","横浜/関内6002801",50000]
["0323","港運部　SITC船用金","148100","仮払金",500000]
["0331","京浜支店　業務課","109865","横浜/関内6002623",750000]
{"$rows_left_out":48}
{"sheet":"BI","index":8,"n_rows":153,"n_cols":26,"rows_kept":153,"cut":false,"hidden":true,"merged":[]}
[]
[null,"伝票日付","会社","転記日付","伝票ﾀｲﾌﾟ","通貨ｺｰﾄﾞ","換算ﾚｰﾄ","参照伝票番号","ヘッダテキスト","税自動計算","転記ｷｰ","勘定コード","特殊GL","金額","国内通貨額","税ｺｰﾄﾞ","事業領域","原価センタ","利益センタ","ソートキー","明細テキスト","起算日","期日","振出日","支払方法","支払保留"]
[null,{"$f":"IF(小口精算シート!D11=\"\",\"\",小口精算シート!D11)","v":""},{"$f":"IF(B3=\"\",\"\",\"NS\")","v":""},{"$f":"IF(B3=\"\",\"\",B3)","v":""},{"$f":"IF(B3=\"\",\"\",\"SA\")","v":""},{"$f":"IF(B3=\"\",\"\",\"JPY\")","v":""},null,null,{"$f":"IF(B3=\"\",\"\",小口精算シート!D7&\"小口現金精算\")","v":""},{"$f":"IF(B3=\"\",\"\",\"×\")","v":""},{"$f":"IF(B3=\"\",\"\",\"50\")","v":""},{"$f":"IF(B3=\"\",\"\",小口精算シート!$G$7)","v":""},null,{"$f":"IF(B3=\"\",\"\",小口精算シート!D9)","v":""},null,null,{"$f":"IF(B3=\"\",\"\",小口精算シート!E7)","v":""},null,null,{"$f":"IF(B3=\"\",\"\",I3)","v":""},{"$f":"IF(B3=\"\",\"\",T3)","v":""}]
[{"$f":"IF(小口精算シート!B15=\"\",\"\",小口精算シート!B15)","v":""},null,null,null,null,null,null,null,null,null,{"$f":"IF(A4=\"\",\"\",\"40\")","v":""},{"$f":"IF(A4=\"\",\"\",小口精算シート!C15)","v":""},null,{"$f":"IF(A4=\"\",\"\",小口精算シート!F15)","v":""},null,{"$f":"IF(A4=\"\",\"\",小口精算入力シート_サブ!E6)","v":""},{"$f":"IF(A4=\"\",\"\",小口精算入力シート_サブ!C6)","v":""},{"$f":"IF(A4=\"\",\"\",\"NS-\"&小口精算シート!H15)","v":""},null,{"$f":"IF(A4=\"\",\"\",$T$3)","v":""},{"$f":"IF(A4=\"\",\"\",IF(小口精算シート!I15=\"\",\"\",小口精算シート!I15))","v":""}]
[{"$f":"IF(小口精算シート!B16=\"\",\"\",小口精算シート!B16)","v":""},null,null,null,null,null,null,null,null,null,{"$f":"IF(A5=\"\",\"\",\"40\")","v":""},{"$f":"IF(A5=\"\",\"\",小口精算シート!C16)","v":""},null,{"$f":"IF(A5=\"\",\"\",小口精算シート!F16)","v":""},null,{"$f":"IF(A5=\"\",\"\",小口精算入力シート_サブ!E7)","v":""},{"$f":"IF(A5=\"\",\"\",小口精算入力シート_サブ!C7)","v":""},{"$f":"IF(A5=\"\",\"\",\"NS-\"&小口精算シート!H16)","v":""},null,{"$f":"IF(A5=\"\",\"\",$T$3)","v":""},{"$f":"IF(A5=\"\",\"\",IF(小口精算シート!I16=\"\",\"\",小口精算シート!I16))","v":""}]
[{"$f":"IF(小口精算シート!B17=\"\",\"\",小口精算シート!B17)","v":""},null,null,null,null,null,null,null,null,null,"",{"$f":"IF(A6=\"\",\"\",小口精算シート!C17)","v":""},null,{"$f":"IF(A6=\"\",\"\",小口精算シート!F17)","v":""},null,{"$f":"IF(A6=\"\",\"\",小口精算入力シート_サブ!E8)","v":""},{"$f":"IF(A6=\"\",\"\",小口精算入力シート_サブ!C8)","v":""},{"$f":"IF(A6=\"\",\"\",\"NS-\"&小口精算シート!H17)","v":""},null,"",{"$f":"IF(A6=\"\",\"\",IF(小口精算シート!I17=\"\",\"\",小口精算シート!I17))","v":""}]
[{"$f":"IF(小口精算シート!B18=\"\",\"\",小口精算シート!B18)","v":""},null,null,null,null,null,null,null,null,null,"",{"$f":"IF(A7=\"\",\"\",小口精算シート!C18)","v":""},null,{"$f":"IF(A7=\"\",\"\",小口精算シート!F18)","v":""},null,{"$f":"IF(A7=\"\",\"\",小口精算入力シート_サブ!E9)","v":""},{"$f":"IF(A7=\"\",\"\",小口精算入力シート_サブ!C9)","v":""},{"$f":"IF(A7=\"\",\"\",\"NS-\"&小口精算シート!H18)","v":""},null,"",{"$f":"IF(A7=\"\",\"\",IF(小口精算シート!I18=\"\",\"\",小口精算シート!I18))","v":""}]
[{"$f":"IF(小口精算シート!B19=\"\",\"\",小口精算シート!B19)","v":""},null,null,null,null,null,null,null,null,null,"",{"$f":"IF(A8=\"\",\"\",小口精算シート!C19)","v":""},null,{"$f":"IF(A8=\"\",\"\",小口精算シート!F19)","v":""},null,{"$f":"IF(A8=\"\",\"\",小口精算入力シート_サブ!E10)","v":""},{"$f":"IF(A8=\"\",\"\",小口精算入力シート_サブ!C10)","v":""},{"$f":"IF(A8=\"\",\"\",\"NS-\"&小口精算シート!H19)","v":""},null,"",{"$f":"IF(A8=\"\",\"\",IF(小口精算シート!I19=\"\",\"\",小口精算シート!I19))","v":""}]
[{"$f":"IF(小口精算シート!B20=\"\",\"\",小口精算シート!B20)","v":""},null,null,null,null,null,null,null,null,null,"",{"$f":"IF(A9=\"\",\"\",小口精算シート!C20)","v":""},null,{"$f":"IF(A9=\"\",\"\",小口精算シート!F20)","v":""},null,{"$f":"IF(A9=\"\",\"\",小口精算入力シート_サブ!E11)","v":""},{"$f":"IF(A9=\"\",\"\",小口精算入力シート_サブ!C11)","v":""},{"$f":"IF(A9=\"\",\"\",\"NS-\"&小口精算シート!H20)","v":""},null,"",{"$f":"IF(A9=\"\",\"\",IF(小口精算シート!I20=\"\",\"\",小口精算シート!I20))","v":""}]
[{"$f":"IF(小口精算シート!B21=\"\",\"\",小口精算シート!B21)","v":""},null,null,null,null,null,null,null,null,null,"",{"$f":"IF(A10=\"\",\"\",小口精算シート!C21)","v":""},null,{"$f":"IF(A10=\"\",\"\",小口精算シート!F21)","v":""},null,{"$f":"IF(A10=\"\",\"\",小口精算入力シート_サブ!E12)","v":""},{"$f":"IF(A10=\"\",\"\",小口精算入力シート_サブ!C12)","v":""},{"$f":"IF(A10=\"\",\"\",\"NS-\"&小口精算シート!H21)","v":""},null,"",{"$f":"IF(A10=\"\",\"\",IF(小口精算シート!I21=\"\",\"\",小口精算シート!I21))","v":""}]
[{"$f":"IF(小口精算シート!B22=\"\",\"\",小口精算シート!B22)","v":""},null,null,null,null,null,null,null,null,null,"",{"$f":"IF(A11=\"\",\"\",小口精算シート!C22)","v":""},null,{"$f":"IF(A11=\"\",\"\",小口精算シート!F22)","v":""},null,{"$f":"IF(A11=\"\",\"\",小口精算入力シート_サブ!E13)","v":""},{"$f":"IF(A11=\"\",\"\",小口精算入力シート_サブ!C13)","v":""},{"$f":"IF(A11=\"\",\"\",\"NS-\"&小口精算シート!H22)","v":""},null,"",{"$f":"IF(A11=\"\",\"\",IF(小口精算シート!I22=\"\",\"\",小口精算シート!I22))","v":""}]
[{"$f":"IF(小口精算シート!B23=\"\",\"\",小口精算シート!B23)","v":""},null,null,null,null,null,null,null,null,null,"",{"$f":"IF(A12=\"\",\"\",小口精算シート!C23)","v":""},null,{"$f":"IF(A12=\"\",\"\",小口精算シート!F23)","v":""},null,{"$f":"IF(A12=\"\",\"\",小口精算入力シート_サブ!E14)","v":""},{"$f":"IF(A12=\"\",\"\",小口精算入力シート_サブ!C14)","v":""},{"$f":"IF(A12=\"\",\"\",\"NS-\"&小口精算シート!H23)","v":""},null,"",{"$f":"IF(A12=\"\",\"\",IF(小口精算シート!I23=\"\",\"\",小口精算シート!I23))","v":""}]
[{"$f":"IF(小口精算シート!B24=\"\",\"\",小口精算シート!B24)","v":""},null,null,null,null,null,null,null,null,null,"",{"$f":"IF(A13=\"\",\"\",小口精算シート!C24)","v":""},null,{"$f":"IF(A13=\"\",\"\",小口精算シート!F24)","v":""},null,{"$f":"IF(A13=\"\",\"\",小口精算入力シート_サブ!E15)","v":""},{"$f":"IF(A13=\"\",\"\",小口精算入力シート_サブ!C15)","v":""},{"$f":"IF(A13=\"\",\"\",\"NS-\"&小口精算シート!H24)","v":""},null,"",{"$f":"IF(A13=\"\",\"\",IF(小口精算シート!I24=\"\",\"\",小口精算シート!I24))","v":""}]
[{"$f":"IF(小口精算シート!B25=\"\",\"\",小口精算シート!B25)","v":""},null,null,null,null,null,null,null,null,null,"",{"$f":"IF(A14=\"\",\"\",小口精算シート!C25)","v":""},null,{"$f":"IF(A14=\"\",\"\",小口精算シート!F25)","v":""},null,{"$f":"IF(A14=\"\",\"\",小口精算入力シート_サブ!E16)","v":""},{"$f":"IF(A14=\"\",\"\",小口精算入力シート_サブ!C16)","v":""},{"$f":"IF(A14=\"\",\"\",\"NS-\"&小口精算シート!H25)","v":""},null,"",{"$f":"IF(A14=\"\",\"\",IF(小口精算シート!I25=\"\",\"\",小口精算シート!I25))","v":""}]
[{"$f":"IF(小口精算シート!B26=\"\",\"\",小口精算シート!B26)","v":""},null,null,null,null,null,null,null,null,null,"",{"$f":"IF(A15=\"\",\"\",小口精算シート!C26)","v":""},null,{"$f":"IF(A15=\"\",\"\",小口精算シート!F26)","v":""},null,{"$f":"IF(A15=\"\",\"\",小口精算入力シート_サブ!E17)","v":""},{"$f":"IF(A15=\"\",\"\",小口精算入力シート_サブ!C17)","v":""},{"$f":"IF(A15=\"\",\"\",\"NS-\"&小口精算シート!H26)","v":""},null,"",{"$f":"IF(A15=\"\",\"\",IF(小口精算シート!I26=\"\",\"\",小口精算シート!I26))","v":""}]
{"$rows_left_out":139}
{"sheet":"BTIN","index":9,"n_rows":291,"n_cols":9,"rows_kept":291,"cut":false,"hidden":true,"merged":[]}
["識別","ﾌﾗｸﾞ","入力項目名","入力値","列","画面項目名",null,"INDEX"]
["P-01　",null,null,"一般勘定－明細",null,null,null,"P-01",3]
[2,null,"RF05A-NEWBS",null,"J","転記キー",null,"P-02",22]
[2,null,"RF05A-NEWKO",null,"K","勘定コード",null,"P-03",46]
[2,null,"BDC_OKCODE","/00",null,null,null,"P-04",67]
[1,"#","SAPLKACB","0002",null,null,null,"P-05",85]
[2,"#","BDC_OKCODE","/00",null,null,null,"P-06",108]
[1,null,"SAPMF05A","0300",null,null,null,"P-07",125]
[2,null,"BSEG-WRBTR",null,"M","金額",null,"P-08",142]
[2,null,"BSEG-DMBTR",null,"N","国内通貨額",null,"P-09",159]
[2,null,"BSEG-MWSKZ",null,"O","消費税コード",null,"P-10",181]
[2,null,"BSEG-VALUT",null,"U","起算日",null,"P-11",206]
[2,null,"BSEG-ZUONR",null,"S","ソートキー",null,"P-12",246]
[2,null,"BSEG-SGTXT",null,"T","明細テキスト",null,"P-13",261]
[2,null,"BDC_OKCODE","/00",null,null,null,"P-14",278]
{"$rows_left_out":277}
{"sheet":"TBL","index":10,"n_rows":58,"n_cols":50,"rows_kept":58,"cut":false,"hidden":true,"merged":[]}
["勘定","行",null,"転記ｷｰ","ﾀｲﾌﾟ","特殊","勘定(開始)","勘定(終了)","ﾊﾟﾀｰﾝ","勘定名",null,null,null,"転記ｷｰ","ﾀｲﾌﾟ","特殊","勘定(開始)","勘定(終了)","ﾊﾟﾀｰﾝ","勘定名",null,null,null,"転記ｷｰ","ﾀｲﾌﾟ","特殊","勘定(開始)","勘定(終了)","ﾊﾟﾀｰﾝ","勘定名",null,null,null,"転記ｷｰ","ﾀｲﾌﾟ","特殊","勘定(開始)","勘定(終了)","ﾊﾟﾀｰﾝ","勘定名",null,null,null,"転記ｷｰ","ﾀｲﾌﾟ","特殊","勘定(開始)","勘定(終了)","ﾊﾟﾀｰﾝ","勘定名"]
[1,2,19,"40/50","Ｓ",null,100010,109999,"P-01"," 現金／預金",null,null,null,"09/19","Ｄ","W",112110,112119,"P-06"," 受取手形",null,null,null,"29/39","Ｋ","W",411100,411100,"P-07"," 支払手形",null,null,null,"21/31","K",null,"412100",412109,"P-05"," 買掛金",null,null,null,"01/11","D",null,"113100",113199,"P-04"," 売掛金"]
[2,20,24,"40/50","Ｓ",null,113999,113999,"P-01"," 売掛金-調整",null,null,null,"09/19","Ｄ","M",145100,145100,"P-08"," 未収入金",null,null,null,"29/39","Ｋ","N",414100,414100,"P-09"," 未払金",null,null,null,"21/31","K",null,415100,415100,"P-09"," 未払費用",null,null,null,"01/11","D",null,113200,113200,"P-04"," 社内売掛金"]
[3,25,28,"40/50","Ｓ",null,"114000",116099,"P-01"," 有価証券／自己株式／預け金",null,null,null,"09/19","Ｄ","X",147101,147101,"P-08"," 営業立替金",null,null,null,"29/39","Ｋ","Q",414300,414300,"P-09"," 未払金（有形固定資産）",null,null,null,"eof",null,null,null,null,null,null,null,null,null,"eof"]
[4,29,39,"40/50","Ｓ",null,"121100",127900,"P-03"," 棚卸資産",null,null,null,"09/19","Ｄ","R",147105,147105,"P-08"," 代理店勘定（債権)",null,null,null,"29/39","Ｋ","R",414400,414400,"P-09"," 未払金（無形固定資産）"]
["5",40,41,"40/50","Ｓ",null,135000,140199,"P-02"," 未成工事",null,null,null,"09/19","Ｄ","S",147107,147107,"P-08"," 海外代理店勘定(債権)",null,null,null,"29/39","Ｋ","K",415100,415100,"P-09"," 未払費用"]
["7",42,43,"40/50","Ｓ",null,"141101",141199,"P-01"," 前渡金",null,null,null,"09/19","Ｄ","T",147109,147109,"P-08"," 関係会社立替金",null,null,null,"29/39","Ｋ","U",418305,418305,"P-09"," 代理店勘定預り金"]
[8,44,51,"40/50","Ｓ",null,"142101",142199,"P-01"," 前払費用",null,null,null,"09/19","Ｄ","Q",411910,411919,"P-08"," 割引手形",null,null,null,"29/39","Ｋ","Y",418307,418307,"P-09"," 海外代理店勘定（債務）"]
["9",52,53,"40/50","Ｓ",null,144100,144199,"P-01"," 短期貸付金",null,null,null,"09/19","Ｄ","U",411920,411929,"P-08"," 譲渡手形",null,null,null,"29/39","Ｋ","V",441011,441011,"P-09"," 仮受金－運賃（特定）"]
["eof",null,null,"40/50","Ｓ",null,145110,145199,"P-01"," 未収入金",null,null,null,"09/19","Ｄ","A","416100","416100","P-13"," 前受金",null,null,null,"eof"]
[null,null,null,"40/50","Ｓ",null,146100,146199,"P-01"," 前渡金",null,null,null,"09/19","Ｄ","C","441000","441000","P-13"," 仮受金-仮受売掛"]
[null,null,null,"40/50","Ｓ",null,147100,147199,"P-01"," 社内立替金",null,null,null,"eof"]
[null,null,null,"40/50","Ｓ",null,147200,147299,"P-01"," 関係会社立替金"]
[null,null,null,"40/50","Ｓ",null,148100,148199,"P-01"," 仮払金"]
[null,null,null,"40/50","Ｓ",null,"148200",148209,"P-12"," 仮払消費税"]
{"$rows_left_out":44}
{"sheet":"入力","index":11,"n_rows":46,"n_cols":7,"rows_kept":46,"cut":false,"hidden":true,"merged":[]}
[]
[]
[]
[]
[null,"セル","項 目 名 称","分　　　類","項 目 名",null,"備　　　　　　考"]
[null,"Ａ列"," 伝票日付","　ヘッダ部","BLDAT"]
[null,"Ｂ列"," 会社コード",null,"BUKRS"]
[null,"Ｃ列"," 転記日付",null,"BUDAT"]
[null,"Ｄ列"," 伝票タイプ",null,"BLART"]
[null,"Ｅ列"," 通貨コード",null,"WAERS"]
[null,"Ｆ列"," 換算レート",null,"KURSF"]
[null,"Ｇ列"," 参照伝票番号",null,"XBLNR"]
[null,"Ｈ列"," ヘッダテキスト",null,"BKTXT"]
[null,"Ｉ列"," 税自動計算",null,"XMWST"]
[null,"Ｊ列"," 転記キー","　明細部","NEWBS"]
{"$rows_left_out":32}
{"sheet":"Sheet2","index":13,"n_rows":0,"n_cols":0,"rows_kept":0,"cut":false,"hidden":true,"merged":[]}