{"text_format":"1","workbook":"xlsx","n_sheets":12,"sheets":["Sheet1","Sheet2","使い方","BTIN","TBL","入力","Module1","ProPlus出力","振替伝票登録票","DEN","勘定科目・会社","部課マスタ(2021)"],"not_rendered":{"charts":0,"images":6,"macros":1,"external_links":0,"defined_names":128,"comments":2,"pivot_tables":0},"unopened":[{"sheet":"Module1","index":6,"reason":"part_missing"}],"bounds":{"document_bytes":16777216,"sheet_cells":100000,"rows_first":2000,"rows_last":500,"rows_between":2000,"halvings":0,"cell_chars":16384,"cell_head_chars":4096},"cells_cut":0,"cells_raw":0,"read":"whole","date_system":"1900"}

{"sheet":"Sheet1","index":0,"n_rows":43,"n_cols":8,"rows_kept":43,"cut":false,"hidden":true,"merged":[[2,7,10,7],[11,7,42,7],[0,0,1,0],[2,4,9,4],[0,1,1,1],[10,4,38,4]]}
["№","列","Ｒ　　Ｍ　　標　　準",null,null,"日　新　バ　ー　ジ　ョ　ン"]
[null,null,"項　目　名　称","項　目　名","分類","項　目　名　称","項　目　名","分類"]
[1,"A","伝票日付","BLDAT","ヘッダ","伝票日付","BLDAT","ヘッダ"]
[2,"B","会社ｺｰﾄﾞ","BUKRS",null,"伝票タイプ","BUKRS"]
[3,"C","転記日付","BUDAT",null,"会社コード","BUDAT"]
[4,"D","伝票ﾀｲﾌﾟ","BLART",null,"転記日付","BLART"]
[5,"E","通貨ｺｰﾄﾞ","WAERS",null,"通貨コード","WAERS"]
[6,"F","ヘッダテキスト","BKTXT",null,"換算レート","KURSF"]
[7,"G","参照伝票番号","XBLNR",null,"参照伝票番号","XBLNR"]
[8,"H","税自動計算","XMWST",null,"ヘッダテキスト","BKTXT"]
{"$rows_left_out":34}
{"sheet":"Sheet2","index":1,"n_rows":251,"n_cols":57,"rows_kept":251,"cut":false,"hidden":false,"merged":[]}
["会社コード","会社名","第1キーコード(事業領域範囲)","第1キー名称(事業領域範囲)","第2キーコード(部門範囲)","第2キー名称(部門範囲)","第3キーコード(原価ｾﾝﾀｰ範囲)","第3キー名称(原価ｾﾝﾀｰ範囲)","第4キーコード(種類範囲)","第4キー名称(種類範囲)","第5キーコード(償却費目範囲)","第5キー名称(償却費目範囲)","支払年月日","リース会社コード","リース会社名称","リース取引判定","契約番号","契約年月日","再リース回数","リース開始年月日","物件番号・親","物件番号・枝","物件名称","資産番号・親","資産番号・枝","オンバランス","支払リース料","支払リース料(税込)","消費税額","控除額1","控除額2","控除額3","控除額4","支払利息","元本返済額","減損取崩額","支払残数／支払回数","支払形態区分","残価保証額区分","帳票ID","出力時間","出力条件(帳簿種別)","出力条件(リース取引判定)","出力条件(オンバランス取引)","出力条件(再リース)","出力条件(契約年月日)","出力条件(契約年月日)","出力条件(リース開始年月日)","出力条件(リース開始年月日)","出力条件(残価保証額)","出力条件(支払年月)","出力条件(支払年月)","出力条件(支払日)","出力条件(支払回数)","出力条件(支払回数)","出力条件(契約番号単位で集計する)","出力条件(出力キー)"]
["NS2","株式会社日新","NS00","全社",10,"本社","NS/0101","本社　役員",62,"車両及び運搬具(リース)",3,"一般管理費",20230705,"NS/00CJ71","三菱オートリース㈱","所有権移転外ファイナンス",600560092,20190131,0,20190513,316,1,"ホンダオデッセイ(横浜304ゆ9660)",4710,1,"オンバランス",52400,57640,5240,0,0,0,0,0,52400,0,"9/60","自動引落","通常","0SFALS00500030","2023-07-12T08:58:07","財務帳簿",null,"含める","含める",null,null,null,null,"含める",202307,202307,null,null,null,"集約しない","事業領域範囲・部門範囲・原価ｾﾝﾀｰ範囲・種類範囲・償却費目範囲"]
["NS2","株式会社日新","NS00","全社",10,"本社","NS/0101","本社　役員",62,"車両及び運搬具(リース)",3,"一般管理費",20230705,"NS/00CJ71","三菱オートリース㈱","所有権移転外ファイナンス",600560093,20190131,0,20190513,339,1,"ホンダレジェンド(横浜304ゆ9661)",4711,1,"オンバランス",107800,118580,10780,0,0,0,0,0,107800,0,"9/60","自動引落","通常","0SFALS00500030","2023-07-12T08:58:07","財務帳簿",null,"含める","含める",null,null,null,null,"含める",202307,202307,null,null,null,"集約しない","事業領域範囲・部門範囲・原価ｾﾝﾀｰ範囲・種類範囲・償却費目範囲"]
["NS2","株式会社日新","NS00","全社",10,"本社","NS/0101","本社　役員",63,"工具・器具・備品(リース)",3,"一般管理費",20230705,"NS/00A035","浜銀ファイナンス株式会社","所有権移転外ファイナンス",1903291,20191129,0,20191129,456,1,"カラー複合機(bizhub C558)",4894,1,"オフバランス",10591,11651,1060,0,0,0,0,0,10591,0,"15/60","自動引落","通常","0SFALS00500030","2023-07-12T08:58:07","財務帳簿",null,"含める","含める",null,null,null,null,"含める",202307,202307,null,null,null,"集約しない","事業領域範囲・部門範囲・原価ｾﾝﾀｰ範囲・種類範囲・償却費目範囲"]
["NS2","株式会社日新","NS00","全社",11,"情報システム部","NS/0116","情報システム部　関西システム課",63,"工具・器具・備品(リース)",3,"一般管理費",20230703,"NS/00A130","シャープファイナンス株式会社","所有権移転外ファイナンス",1650521,20210301,0,20210318,525,1,"デジタルカラー複合機(MX5151)",5481,1,"オフバランス",4608,5070,462,0,0,0,0,0,4608,0,"19/48","自動引落","通常","0SFALS00500030","2023-07-12T08:58:07","財務帳簿",null,"含める","含める",null,null,null,null,"含める",202307,202307,null,null,null,"集約しない","事業領域範囲・部門範囲・原価ｾﾝﾀｰ範囲・種類範囲・償却費目範囲"]
["NS2","株式会社日新","NS00","全社",12,"総務部","NS/0120","総務部　本部",63,"工具・器具・備品(リース)",3,"一般管理費",20230705,"NS/00A035","浜銀ファイナンス株式会社","所有権移転外ファイナンス",1903291,20191129,0,20191129,456,3,"カラー複合機(bizhub C558)",4894,3,"オフバランス",1513,1664,151,0,0,0,0,0,1513,0,"15/60","自動引落","通常","0SFALS00500030","2023-07-12T08:58:07","財務帳簿",null,"含める","含める",null,null,null,null,"含める",202307,202307,null,null,null,"集約しない","事業領域範囲・部門範囲・原価ｾﾝﾀｰ範囲・種類範囲・償却費目範囲"]
["NS2","株式会社日新","NS00","全社",13,"経理部","NS/0139","経理部　海外債権債務管理課",63,"工具・器具・備品(リース)",3,"一般管理費",20230705,"NS/00A035","浜銀ファイナンス株式会社","所有権移転外ファイナンス",2100928,20210622,0,20210630,557,1,"カラー複合機(MX-4151)",5690,1,"オフバランス",15530,17083,1553,0,0,0,0,0,15530,0,"34/60","自動引落","通常","0SFALS00500030","2023-07-12T08:58:07","財務帳簿",null,"含める","含める",null,null,null,null,"含める",202307,202307,null,null,null,"集約しない","事業領域範囲・部門範囲・原価ｾﾝﾀｰ範囲・種類範囲・償却費目範囲"]
["NS2","株式会社日新","NS00","全社",16,"安全環境管理部","NS/0162","安全環境管理部　安全管理課",62,"車両及び運搬具(リース)",3,"一般管理費",20230705,"NS/00JZ91","三菱HCキャピタル株式会社","所有権移転外ファイナンス",601381533,20170329,0,20170501,424,1,"ﾎﾝﾀﾞｽﾃｯﾌﾟﾜｺﾞﾝ　横浜505せ9997",4436,1,"オンバランス",38500,42350,3850,0,0,0,0,0,38500,0,"9/84","自動引落","通常","0SFALS00500030","2023-07-12T08:58:07","財務帳簿",null,"含める","含める",null,null,null,null,"含める",202307,202307,null,null,null,"集約しない","事業領域範囲・部門範囲・原価ｾﾝﾀｰ範囲・種類範囲・償却費目範囲"]
["NS2","株式会社日新","NS00","全社",16,"安全環境管理部","NS/0162","安全環境管理部　安全管理課",62,"車両及び運搬具(リース)",3,"一般管理費",20230705,"NS/00JZ91","三菱HCキャピタル株式会社","オペレーティング","601381533-2",20190412,0,20190701,362,1,"タイヤ保管特約(横浜505せ9997)",4727,1,"オフバランス",1400,1540,140,0,0,0,0,0,0,0,"9/58","自動引落","通常","0SFALS00500030","2023-07-12T08:58:07","財務帳簿",null,"含める","含める",null,null,null,null,"含める",202307,202307,null,null,null,"集約しない","事業領域範囲・部門範囲・原価ｾﾝﾀｰ範囲・種類範囲・償却費目範囲"]
["NS2","株式会社日新","NS00","全社",18,"秘書室","NS/0150","秘書室　　　　　　　",63,"工具・器具・備品(リース)",3,"一般管理費",20230705,"NS/00A035","浜銀ファイナンス株式会社","所有権移転外ファイナンス",1903291,20191129,0,20191129,456,2,"カラー複合機(bizhub C558)",4894,2,"オフバランス",3026,3328,302,0,0,0,0,0,3026,0,"15/60","自動引落","通常","0SFALS00500030","2023-07-12T08:58:07","財務帳簿",null,"含める","含める",null,null,null,null,"含める",202307,202307,null,null,null,"集約しない","事業領域範囲・部門範囲・原価ｾﾝﾀｰ範囲・種類範囲・償却費目範囲"]
{"$rows_left_out":242}
{"sheet":"使い方","index":2,"n_rows":71,"n_cols":9,"rows_kept":71,"cut":false,"hidden":false,"merged":[]}
[null,"使い方"]
[]
[null,"①ProPlusのFA/リース資産管理/物件リース料支払リストから以下の条件で出力したCSVデータをデスクトップ等適当な場所に保存する。"]
[null,"　 支払年月日は被請求年月日の翌々月が基本(ニッセイリースは翌月・住友三井オートサービスが翌月等一部例外あり)"]
[]
[]
[]
[]
[]
[]
{"$rows_left_out":62}
{"sheet":"BTIN","index":3,"n_rows":291,"n_cols":9,"rows_kept":291,"cut":false,"hidden":true,"merged":[]}
["識別","ﾌﾗｸﾞ","入力項目名","入力値","列","画面項目名",null,"INDEX"]
["P-01　",null,null,"一般勘定－明細",null,null,null,"P-01",3]
[2,null,"RF05A-NEWBS",null,"J","転記キー",null,"P-02",22]
[2,null,"RF05A-NEWKO",null,"K","勘定コード",null,"P-03",46]
[2,null,"BDC_OKCODE","/00",null,null,null,"P-04",67]
[1,"#","SAPLKACB","0002",null,null,null,"P-05",85]
[2,"#","BDC_OKCODE","/00",null,null,null,"P-06",108]
[1,null,"SAPMF05A","0300",null,null,null,"P-07",125]
[2,null,"BSEG-WRBTR",null,"M","金額",null,"P-08",142]
[2,null,"BSEG-DMBTR",null,"N","国内通貨額",null,"P-09",159]
{"$rows_left_out":282}
{"sheet":"TBL","index":4,"n_rows":58,"n_cols":50,"rows_kept":58,"cut":false,"hidden":true,"merged":[]}
["勘定","行",null,"転記ｷｰ","ﾀｲﾌﾟ","特殊","勘定(開始)","勘定(終了)","ﾊﾟﾀｰﾝ","勘定名",null,null,null,"転記ｷｰ","ﾀｲﾌﾟ","特殊","勘定(開始)","勘定(終了)","ﾊﾟﾀｰﾝ","勘定名",null,null,null,"転記ｷｰ","ﾀｲﾌﾟ","特殊","勘定(開始)","勘定(終了)","ﾊﾟﾀｰﾝ","勘定名",null,null,null,"転記ｷｰ","ﾀｲﾌﾟ","特殊","勘定(開始)","勘定(終了)","ﾊﾟﾀｰﾝ","勘定名",null,null,null,"転記ｷｰ","ﾀｲﾌﾟ","特殊","勘定(開始)","勘定(終了)","ﾊﾟﾀｰﾝ","勘定名"]
[1,2,19,"40/50","Ｓ",null,100010,109999,"P-01"," 現金／預金",null,null,null,"09/19","Ｄ","W",112110,112119,"P-06"," 受取手形",null,null,null,"29/39","Ｋ","W",411100,411100,"P-07"," 支払手形",null,null,null,"21/31","K",null,"412100",412109,"P-05"," 買掛金",null,null,null,"01/11","D",null,"113100",113199,"P-04"," 売掛金"]
[2,20,24,"40/50","Ｓ",null,113999,113999,"P-01"," 売掛金-調整",null,null,null,"09/19","Ｄ","M",145100,145100,"P-08"," 未収入金",null,null,null,"29/39","Ｋ","N",414100,414100,"P-09"," 未払金",null,null,null,"21/31","K",null,415100,415100,"P-09"," 未払費用",null,null,null,"01/11","D",null,113200,113200,"P-04"," 社内売掛金"]
[3,25,28,"40/50","Ｓ",null,"114000",116099,"P-01"," 有価証券／自己株式／預け金",null,null,null,"09/19","Ｄ","X",147101,147101,"P-08"," 営業立替金",null,null,null,"29/39","Ｋ","Q",414300,414300,"P-09"," 未払金（有形固定資産）",null,null,null,"eof",null,null,null,null,null,null,null,null,null,"eof"]
[4,29,39,"40/50","Ｓ",null,"121100",127900,"P-03"," 棚卸資産",null,null,null,"09/19","Ｄ","R",147105,147105,"P-08"," 代理店勘定（債権)",null,null,null,"29/39","Ｋ","R",414400,414400,"P-09"," 未払金（無形固定資産）"]
["5",40,41,"40/50","Ｓ",null,135000,140199,"P-02"," 未成工事",null,null,null,"09/19","Ｄ","S",147107,147107,"P-08"," 海外代理店勘定(債権)",null,null,null,"29/39","Ｋ","K",415100,415100,"P-09"," 未払費用"]
["7",42,43,"40/50","Ｓ",null,"141101",141199,"P-01"," 前渡金",null,null,null,"09/19","Ｄ","T",147109,147109,"P-08"," 関係会社立替金",null,null,null,"29/39","Ｋ","U",418305,418305,"P-09"," 代理店勘定預り金"]
[8,44,51,"40/50","Ｓ",null,"142101",142199,"P-01"," 前払費用",null,null,null,"09/19","Ｄ","Q",411910,411919,"P-08"," 割引手形",null,null,null,"29/39","Ｋ","Y",418307,418307,"P-09"," 海外代理店勘定（債務）"]
["9",52,53,"40/50","Ｓ",null,144100,144199,"P-01"," 短期貸付金",null,null,null,"09/19","Ｄ","U",411920,411929,"P-08"," 譲渡手形",null,null,null,"29/39","Ｋ","V",441011,441011,"P-09"," 仮受金－運賃（特定）"]
["eof",null,null,"40/50","Ｓ",null,145110,145199,"P-01"," 未収入金",null,null,null,"09/19","Ｄ","A","416100","416100","P-13"," 前受金",null,null,null,"eof"]
{"$rows_left_out":49}
{"sheet":"入力","index":5,"n_rows":46,"n_cols":7,"rows_kept":46,"cut":false,"hidden":true,"merged":[]}
[]
[]
[]
[]
[null,"セル","項 目 名 称","分　　　類","項 目 名",null,"備　　　　　　考"]
[null,"Ａ列"," 伝票日付","　ヘッダ部","BLDAT"]
[null,"Ｂ列"," 会社コード",null,"BUKRS"]
[null,"Ｃ列"," 転記日付",null,"BUDAT"]
[null,"Ｄ列"," 伝票タイプ",null,"BLART"]
[null,"Ｅ列"," 通貨コード",null,"WAERS"]
{"$rows_left_out":37}
{"sheet":"ProPlus出力","index":7,"n_rows":289,"n_cols":66,"rows_kept":289,"cut":false,"hidden":false,"merged":[]}
["地区","勘定コード","勘定名称","金額","税コード","事業領域","部課コード","ソートキー","テキスト","会社コード","会社名","第1キーコード(事業領域範囲)","第1キー名称(事業領域範囲)","第2キーコード(部門範囲)","第2キー名称(部門範囲)","第3キーコード(原価ｾﾝﾀｰ範囲)","第3キー名称(原価ｾﾝﾀｰ範囲)","第4キーコード(種類範囲)","第4キー名称(種類範囲)","第5キーコード(償却費目範囲)","第5キー名称(償却費目範囲)","支払年月日","リース会社コード","リース会社名称","リース取引判定","契約番号","契約年月日","再リース回数","リース開始年月日","物件番号・親","物件番号・枝","物件名称","資産番号・親","資産番号・枝","オンバランス","支払リース料","支払リース料(税込)","消費税額","控除額1","控除額2","控除額3","控除額4","支払利息","元本返済額","減損取崩額","支払残数／支払回数","支払形態区分","残価保証額区分","帳票ID","出力時間","出力条件(帳簿種別)","出力条件(リース取引判定)","出力条件(オンバランス取引)","出力条件(再リース)","出力条件(契約年月日)","出力条件(契約年月日)","出力条件(リース開始年月日)","出力条件(リース開始年月日)","出力条件(残価保証額)","出力条件(支払年月)","出力条件(支払年月)","出力条件(支払日)","出力条件(支払回数)","出力条件(支払回数)","出力条件(契約番号単位で集計する)","出力条件(出力キー)"]
[{"$f":"IFERROR(VLOOKUP(Z2,勘定科目・会社!$K$2:$L$2,2,FALSE),(VLOOKUP(RIGHT(P2,4),'部課マスタ(2021)'!B:I,8,FALSE)))","v":"関東"},{"$f":"IFERROR(VLOOKUP(Z2,勘定科目・会社!B:C,2,FALSE),IF(AI2=\"オンバランス\",142103,IF(T2=0,\"\",VLOOKUP(S2&U2,勘定科目・会社!$B:$D,2,FALSE))))","v":142103},{"$f":"IFERROR(VLOOKUP(B2,勘定科目・会社!C:D,2,FALSE),\"\")","v":"前払リース料"},{"$f":"AK2","v":57640},{"$f":"IF(B2=142103,\"\",IF(AL2/AJ2>0.08,\"AA\",\"A8\"))","v":""},{"$f":"L2","v":"NS00"},{"$f":"\"NS-\"&RIGHT(P2,4)","v":"NS-0101"},{"$f":"\"NS-\"&RIGHT(W2,6)","v":"NS-00CJ71"},{"$f":"LEFTB(\"残\"&AT2&\" \"&Z2&\" \"&AF2,50)","v":"残9/60 600560092 ホンダオデッセイ(横浜304ゆ9660)"},"NS2","株式会社日新","NS00","全社",10,"本社","NS/0101","本社　役員",62,"車両及び運搬具(リース)",3,"一般管理費",20230705,"NS/00CJ71","三菱オートリース㈱","所有権移転外ファイナンス",600560092,20190131,0,20190513,316,1,"ホンダオデッセイ(横浜304ゆ9660)",4710,1,"オンバランス",52400,57640,5240,0,0,0,0,0,52400,0,"9/60","自動引落","通常","0SFALS00500030","2023-07-12T08:58:07","財務帳簿",null,"含める","含める",null,null,null,null,"含める",202307,202307,null,null,null,"集約しない","事業領域範囲・部門範囲・原価ｾﾝﾀｰ範囲・種類範囲・償却費目範囲"]
[{"$f":"IFERROR(VLOOKUP(Z3,勘定科目・会社!$K$2:$L$2,2,FALSE),(VLOOKUP(RIGHT(P3,4),'部課マスタ(2021)'!B:I,8,FALSE)))","v":"関東"},{"$f":"IFERROR(VLOOKUP(Z3,勘定科目・会社!B:C,2,FALSE),IF(AI3=\"オンバランス\",142103,IF(T3=0,\"\",VLOOKUP(S3&U3,勘定科目・会社!$B:$D,2,FALSE))))","v":142103},{"$f":"IFERROR(VLOOKUP(B3,勘定科目・会社!C:D,2,FALSE),\"\")","v":"前払リース料"},{"$f":"AK3","v":118580},"",{"$f":"L3","v":"NS00"},{"$f":"\"NS-\"&RIGHT(P3,4)","v":"NS-0101"},{"$f":"\"NS-\"&RIGHT(W3,6)","v":"NS-00CJ71"},{"$f":"LEFTB(\"残\"&AT3&\" \"&Z3&\" \"&AF3,50)","v":"残9/60 600560093 ホンダレジェンド(横浜304ゆ9661)"},"NS2","株式会社日新","NS00","全社",10,"本社","NS/0101","本社　役員",62,"車両及び運搬具(リース)",3,"一般管理費",20230705,"NS/00CJ71","三菱オートリース㈱","所有権移転外ファイナンス",600560093,20190131,0,20190513,339,1,"ホンダレジェンド(横浜304ゆ9661)",4711,1,"オンバランス",107800,118580,10780,0,0,0,0,0,107800,0,"9/60","自動引落","通常","0SFALS00500030","2023-07-12T08:58:07","財務帳簿",null,"含める","含める",null,null,null,null,"含める",202307,202307,null,null,null,"集約しない","事業領域範囲・部門範囲・原価ｾﾝﾀｰ範囲・種類範囲・償却費目範囲"]
[{"$f":"IFERROR(VLOOKUP(Z4,勘定科目・会社!$K$2:$L$2,2,FALSE),(VLOOKUP(RIGHT(P4,4),'部課マスタ(2021)'!B:I,8,FALSE)))","v":"関東"},{"$f":"IFERROR(VLOOKUP(Z4,勘定科目・会社!B:C,2,FALSE),IF(AI4=\"オンバランス\",142103,IF(T4=0,\"\",VLOOKUP(S4&U4,勘定科目・会社!$B:$D,2,FALSE))))","v":351620},{"$f":"IFERROR(VLOOKUP(B4,勘定科目・会社!C:D,2,FALSE),\"\")","v":"売上原価-賃借事務器"},11651,"AA","NS00","NS-0101","NS-00A035","残15/60 1903291 カラー複合機(bizhub C558)","NS2","株式会社日新","NS00","全社",10,"本社","NS/0101","本社　役員",63,"工具・器具・備品(リース)",3,"一般管理費",20230705,"NS/00A035","浜銀ファイナンス株式会社","所有権移転外ファイナンス",1903291,20191129,0,20191129,456,1,"カラー複合機(bizhub C558)",4894,1,"オフバランス",10591,11651,1060,0,0,0,0,0,10591,0,"15/60","自動引落","通常","0SFALS00500030","2023-07-12T08:58:07","財務帳簿",null,"含める","含める",null,null,null,null,"含める",202307,202307,null,null,null,"集約しない","事業領域範囲・部門範囲・原価ｾﾝﾀｰ範囲・種類範囲・償却費目範囲"]
[{"$f":"IFERROR(VLOOKUP(Z5,勘定科目・会社!$K$2:$L$2,2,FALSE),(VLOOKUP(RIGHT(P5,4),'部課マスタ(2021)'!B:I,8,FALSE)))","v":"関西"},{"$f":"IFERROR(VLOOKUP(Z5,勘定科目・会社!B:C,2,FALSE),IF(AI5=\"オンバランス\",142103,IF(T5=0,\"\",VLOOKUP(S5&U5,勘定科目・会社!$B:$D,2,FALSE))))","v":351620},{"$f":"IFERROR(VLOOKUP(B5,勘定科目・会社!C:D,2,FALSE),\"\")","v":"売上原価-賃借事務器"},5070,"AA","NS00","NS-0116","NS-00A130","残19/48 1650521 デジタルカラー複合機(MX5151)","NS2","株式会社日新","NS00","全社",11,"情報システム部","NS/0116","情報システム部　関西システム課",63,"工具・器具・備品(リース)",3,"一般管理費",20230703,"NS/00A130","シャープファイナンス株式会社","所有権移転外ファイナンス",1650521,20210301,0,20210318,525,1,"デジタルカラー複合機(MX5151)",5481,1,"オフバランス",4608,5070,462,0,0,0,0,0,4608,0,"19/48","自動引落","通常","0SFALS00500030","2023-07-12T08:58:07","財務帳簿",null,"含める","含める",null,null,null,null,"含める",202307,202307,null,null,null,"集約しない","事業領域範囲・部門範囲・原価ｾﾝﾀｰ範囲・種類範囲・償却費目範囲"]
[{"$f":"IFERROR(VLOOKUP(Z6,勘定科目・会社!$K$2:$L$2,2,FALSE),(VLOOKUP(RIGHT(P6,4),'部課マスタ(2021)'!B:I,8,FALSE)))","v":"関東"},{"$f":"IFERROR(VLOOKUP(Z6,勘定科目・会社!B:C,2,FALSE),IF(AI6=\"オンバランス\",142103,IF(T6=0,\"\",VLOOKUP(S6&U6,勘定科目・会社!$B:$D,2,FALSE))))","v":351620},{"$f":"IFERROR(VLOOKUP(B6,勘定科目・会社!C:D,2,FALSE),\"\")","v":"売上原価-賃借事務器"},1664,"AA","NS00","NS-0120","NS-00A035","残15/60 1903291 カラー複合機(bizhub C558)","NS2","株式会社日新","NS00","全社",12,"総務部","NS/0120","総務部　本部",63,"工具・器具・備品(リース)",3,"一般管理費",20230705,"NS/00A035","浜銀ファイナンス株式会社","所有権移転外ファイナンス",1903291,20191129,0,20191129,456,3,"カラー複合機(bizhub C558)",4894,3,"オフバランス",1513,1664,151,0,0,0,0,0,1513,0,"15/60","自動引落","通常","0SFALS00500030","2023-07-12T08:58:07","財務帳簿",null,"含める","含める",null,null,null,null,"含める",202307,202307,null,null,null,"集約しない","事業領域範囲・部門範囲・原価ｾﾝﾀｰ範囲・種類範囲・償却費目範囲"]
[{"$f":"IFERROR(VLOOKUP(Z7,勘定科目・会社!$K$2:$L$2,2,FALSE),(VLOOKUP(RIGHT(P7,4),'部課マスタ(2021)'!B:I,8,FALSE)))","v":"関東"},{"$f":"IFERROR(VLOOKUP(Z7,勘定科目・会社!B:C,2,FALSE),IF(AI7=\"オンバランス\",142103,IF(T7=0,\"\",VLOOKUP(S7&U7,勘定科目・会社!$B:$D,2,FALSE))))","v":351620},{"$f":"IFERROR(VLOOKUP(B7,勘定科目・会社!C:D,2,FALSE),\"\")","v":"売上原価-賃借事務器"},17083,"AA","NS00","NS-0139","NS-00A035","残34/60 2100928 カラー複合機(MX-4151)","NS2","株式会社日新","NS00","全社",13,"経理部","NS/0139","経理部　海外債権債務管理課",63,"工具・器具・備品(リース)",3,"一般管理費",20230705,"NS/00A035","浜銀ファイナンス株式会社","所有権移転外ファイナンス",2100928,20210622,0,20210630,557,1,"カラー複合機(MX-4151)",5690,1,"オフバランス",15530,17083,1553,0,0,0,0,0,15530,0,"34/60","自動引落","通常","0SFALS00500030","2023-07-12T08:58:07","財務帳簿",null,"含める","含める",null,null,null,null,"含める",202307,202307,null,null,null,"集約しない","事業領域範囲・部門範囲・原価ｾﾝﾀｰ範囲・種類範囲・償却費目範囲"]
[{"$f":"IFERROR(VLOOKUP(Z8,勘定科目・会社!$K$2:$L$2,2,FALSE),(VLOOKUP(RIGHT(P8,4),'部課マスタ(2021)'!B:I,8,FALSE)))","v":"関東"},{"$f":"IFERROR(VLOOKUP(Z8,勘定科目・会社!B:C,2,FALSE),IF(AI8=\"オンバランス\",142103,IF(T8=0,\"\",VLOOKUP(S8&U8,勘定科目・会社!$B:$D,2,FALSE))))","v":142103},{"$f":"IFERROR(VLOOKUP(B8,勘定科目・会社!C:D,2,FALSE),\"\")","v":"前払リース料"},42350,"","NS00","NS-0162","NS-00JZ91","残9/84 601381533 ﾎﾝﾀﾞｽﾃｯﾌﾟﾜｺﾞﾝ　横浜505せ9997","NS2","株式会社日新","NS00","全社",16,"安全環境管理部","NS/0162","安全環境管理部　安全管理課",62,"車両及び運搬具(リース)",3,"一般管理費",20230705,"NS/00JZ91","三菱HCキャピタル株式会社","所有権移転外ファイナンス",601381533,20170329,0,20170501,424,1,"ﾎﾝﾀﾞｽﾃｯﾌﾟﾜｺﾞﾝ　横浜505せ9997",4436,1,"オンバランス",38500,42350,3850,0,0,0,0,0,38500,0,"9/84","自動引落","通常","0SFALS00500030","2023-07-12T08:58:07","財務帳簿",null,"含める","含める",null,null,null,null,"含める",202307,202307,null,null,null,"集約しない","事業領域範囲・部門範囲・原価ｾﾝﾀｰ範囲・種類範囲・償却費目範囲"]
[{"$f":"IFERROR(VLOOKUP(Z9,勘定科目・会社!$K$2:$L$2,2,FALSE),(VLOOKUP(RIGHT(P9,4),'部課マスタ(2021)'!B:I,8,FALSE)))","v":"関東"},{"$f":"IFERROR(VLOOKUP(Z9,勘定科目・会社!B:C,2,FALSE),IF(AI9=\"オンバランス\",142103,IF(T9=0,\"\",VLOOKUP(S9&U9,勘定科目・会社!$B:$D,2,FALSE))))","v":351600},{"$f":"IFERROR(VLOOKUP(B9,勘定科目・会社!C:D,2,FALSE),\"\")","v":"売上原価-賃借料"},1540,"AA","NS00","NS-0162","NS-00JZ91","残9/58 601381533-2 タイヤ保管特約(横浜505せ9997)","NS2","株式会社日新","NS00","全社",16,"安全環境管理部","NS/0162","安全環境管理部　安全管理課",62,"車両及び運搬具(リース)",3,"一般管理費",20230705,"NS/00JZ91","三菱HCキャピタル株式会社","オペレーティング","601381533-2",20190412,0,20190701,362,1,"タイヤ保管特約(横浜505せ9997)",4727,1,"オフバランス",1400,1540,140,0,0,0,0,0,0,0,"9/58","自動引落","通常","0SFALS00500030","2023-07-12T08:58:07","財務帳簿",null,"含める","含める",null,null,null,null,"含める",202307,202307,null,null,null,"集約しない","事業領域範囲・部門範囲・原価ｾﾝﾀｰ範囲・種類範囲・償却費目範囲"]
[{"$f":"IFERROR(VLOOKUP(Z10,勘定科目・会社!$K$2:$L$2,2,FALSE),(VLOOKUP(RIGHT(P10,4),'部課マスタ(2021)'!B:I,8,FALSE)))","v":"関東"},{"$f":"IFERROR(VLOOKUP(Z10,勘定科目・会社!B:C,2,FALSE),IF(AI10=\"オンバランス\",142103,IF(T10=0,\"\",VLOOKUP(S10&U10,勘定科目・会社!$B:$D,2,FALSE))))","v":351620},{"$f":"IFERROR(VLOOKUP(B10,勘定科目・会社!C:D,2,FALSE),\"\")","v":"売上原価-賃借事務器"},3328,"AA","NS00","NS-0150","NS-00A035","残15/60 1903291 カラー複合機(bizhub C558)","NS2","株式会社日新","NS00","全社",18,"秘書室","NS/0150","秘書室　　　　　　　",63,"工具・器具・備品(リース)",3,"一般管理費",20230705,"NS/00A035","浜銀ファイナンス株式会社","所有権移転外ファイナンス",1903291,20191129,0,20191129,456,2,"カラー複合機(bizhub C558)",4894,2,"オフバランス",3026,3328,302,0,0,0,0,0,3026,0,"15/60","自動引落","通常","0SFALS00500030","2023-07-12T08:58:07","財務帳簿",null,"含める","含める",null,null,null,null,"含める",202307,202307,null,null,null,"集約しない","事業領域範囲・部門範囲・原価ｾﾝﾀｰ範囲・種類範囲・償却費目範囲"]
{"$rows_left_out":280}
{"sheet":"振替伝票登録票","index":8,"n_rows":33,"n_cols":9,"rows_kept":33,"cut":false,"hidden":false,"merged":[[0,0,0,8],[2,4,2,5],[2,6,2,7],[3,4,5,5],[3,6,5,7]]}
["振替伝票登録票"]
[]
[null,"記帳日","2023.07.31",null,"担当者",null,"承認者"]
[null,"リース会社名","株式会社イチネン",{"$f":"VLOOKUP(C4,勘定科目・会社!G:H,2,FALSE)","v":"イチネン"}]
[null,"支払額(税込)"]
[null,"振替額",{"$f":"SUM(D:D)","v":751190}]
[null,"支払-振替",{"$f":"C5-C6","v":-751190}]
["貸借","勘定コード","勘定名称","金額","税コード","事業領域","部課コード","ソートキー","テキスト"]
[40,351600,"売上原価-賃借料",35090,"AA","NS01","NS-0850","NS-00I520","残57/60 LZ699451 ホンダフィット（なにわ502の9161）"]
[40,351600,"売上原価-賃借料",35200,"AA","NS01","NS-0857","NS-00I520","残51/60 LZ688851 ホンダフィット（なにわ502の2594）"]
{"$rows_left_out":24}
{"sheet":"DEN","index":9,"n_rows":30,"n_cols":41,"rows_kept":30,"cut":false,"hidden":false,"merged":[]}
[4,null,"X","　←　“X”を入力し、バッチインプットの処理モードを“E”で実行すると伝票概要画面で止まり、確認することが出来る"]
["伝票日付","会社","転記日付","伝票ﾀｲﾌﾟ","通貨ｺｰﾄﾞ","換算ﾚｰﾄ","参照伝票番号","ヘッダテキスト","税自動計算","転記ｷｰ","勘定コード","特殊GL","金額","国内通貨額","税ｺｰﾄﾞ","事業領域","原価センタ","利益センタ","ソートキー","明細テキスト","起算日","期日","振出日","支払方法","支払保留","取引先銀行","取引銀行","中央銀行CD","数量","数量単位","指図書","ＷＢＳ","得意先ｺｰﾄﾞ","品目ｺｰﾄﾞ","販売組織","流通ﾁｬﾈﾙ","製品部門","品目ｸﾞﾙｰﾌﾟ","営業所","営業グループ","需要家"]
["2023.07.12","NS","2023.07.31","SA","JPY",null,null,"イチネン","X",40,351600,null,35090,null,"AA","NS01","NS-0850",null,"NS-00I520","残57/60 LZ699451 ホンダフィット（なにわ502の9161）"]
[null,null,null,null,null,null,null,null,null,40,351600,null,35200,null,"AA","NS01","NS-0857",null,"NS-00I520","残51/60 LZ688851 ホンダフィット（なにわ502の2594）"]
[null,null,null,null,null,null,null,null,null,40,351600,null,44880,null,"AA","NS01","NS-0858",null,"NS-00I520","残58/60 LZ700821 ホンダフリード（なにわ502は1192）"]
[null,null,null,null,null,null,null,null,null,40,351600,null,44880,null,"AA","NS01","NS-0858",null,"NS-00I520","残59/60 LZ700821 ホンダフリード（なにわ502は1192）"]
[null,null,null,null,null,null,null,null,null,40,351600,null,20680,null,"AA","NS01","NS-0865",null,"NS-00I520","残8/24 LZ439964 神戸　581ｿ448"]
[null,null,null,null,null,null,null,null,null,40,351600,null,32670,null,"AA","NS01","NS-0865",null,"NS-00I520","残12/60 LZ607551 トヨタヴィッツ(神戸504ぬ8928)"]
[null,null,null,null,null,null,null,null,null,40,351600,null,25850,null,"AA","NS01","NS-0523",null,"NS-00I520","残21/24 LZ468474 ホンダワゴン（神戸503ま3437）"]
[null,null,null,null,null,null,null,null,null,40,351600,null,26400,null,"AA","NS01","NS-0523",null,"NS-00I520","残11/24 LZ474384 神戸400ノ8633"]
{"$rows_left_out":21}
{"sheet":"勘定科目・会社","index":10,"n_rows":22,"n_cols":12,"rows_kept":22,"cut":false,"hidden":false,"merged":[]}
[null,"勘定科目一覧",null,null,null,"リース会社一覧",null,null,null,null,"関西へ振替"]
[null,"種類&費目","勘定コード","勘定科目",null,"コード","名称","略称","備考",null,1456739,"関西"]
[null,"車両及び運搬具(リース)売上原価・直接費",351600,"売上原価-賃借料",null,"NS/003321","トヨタエルアンドエフ神奈川㈱","トヨタL&F"]
[null,"工具・器具・備品(リース)売上原価・直接費",351620,"売上原価-賃借事務器",null,"NS/007046","三菱UFJ信託銀行株式会社","三菱UFJ信託"]
[null,"車両及び運搬具(リース)売上原価・間接費",351600,"売上原価-賃借料",null,"NS/007653","セコムクレジット株式会社","セコムクレジット"]
[null,"車両及び運搬具(リース)一般管理費",351600,"売上原価-賃借料",null,"NS/00A010","第一リース株式会社","第一リース","永新電話設備は前払リース料で出金起票のため登録票から行削除"]
[null,null,null,null,null,"NS/00A035","浜銀ファイナンス株式会社","浜銀ファイナンス"]
[null,"工具・器具・備品(リース)売上原価・間接費",351620,"売上原価-賃借事務器",null,"NS/00A130","シャープファイナンス株式会社","シャープファイナンス","月後半契約のリースはリース開始翌月から振替"]
[null,"工具・器具・備品(リース)一般管理費",351620,"売上原価-賃借事務器",null,"NS/00B054","ニッセイリース株式会社","ニッセイリース","初回リース料は当月～翌月の2ヵ月分"]
[null,null,142103,"前払リース料",null,"NS/00BC91","住友三井オートサービス株式会社","住友三井オートサービス"]
{"$rows_left_out":13}
{"sheet":"部課マスタ(2021)","index":11,"n_rows":458,"n_cols":9,"rows_kept":458,"cut":false,"hidden":false,"merged":[[8,8,10,8],[9,5,10,6],[9,7,10,7],[1,1,1,7],[3,0,3,1],[8,0,10,0],[8,1,10,1],[8,2,10,2],[8,3,10,3],[8,5,8,7]]}
[]
[null,"2023年度　部課コード表"]
[]
["2022.05.16"]
[]
[null,"※\"R3情報\"は経理部使用。"]
[]
[]
["部門コード","部課コ－ド","部　課　名　称","経費科目区分",null,"R3情報",null,null,"地区"]
[null,null,null,null,null,"事業領域",null,"原価センター区分"]
{"$rows_left_out":448}