{"text_format":"1","workbook":"xlsx","n_sheets":10,"sheets":["伝票入力","DEN","マスタ管理","仕入先マスタ管理","支払条件コード","データ取込","BTIN","TBL","Module1","ソートキー管理"],"not_rendered":{"charts":0,"images":0,"macros":1,"external_links":1,"defined_names":24,"comments":5,"pivot_tables":0},"unopened":[{"sheet":"Module1","index":8,"reason":"part_missing"}],"bounds":{"document_bytes":16777216,"sheet_cells":100000,"rows_first":2000,"rows_last":500,"rows_between":2000,"halvings":0,"cell_chars":16384,"cell_head_chars":4096},"cells_cut":0,"cells_raw":0,"read":"whole","date_system":"1900"}

{"sheet":"伝票入力","index":0,"n_rows":430,"n_cols":19,"rows_kept":430,"cut":false,"hidden":true,"merged":[[4,0,4,4],[4,5,4,18]]}
[null,null,null,null,null,"追加伝票数",1,"伝票種別","振替","会社コード","SU"]
[null,null,null,null,null,"1伝票明細数",2,"伝票日付",{"$f":"NOW()","v":"2023-07-07T16:47:43.980"},"伝票タイプ","SA",null,null,"借方合計",{"$f":"SUMIF($N$7:$N$6212,\"借方合計\",$O$7:$O$6212)","v":191458923},null,"差異"]
[null,null,null,null,null,null,null,"消込キー","消込","通貨コード","JPY",null,null,"貸方合計",{"$f":"SUMIF($N$7:$N$6212,\"貸方合計\",$O$7:$O$6212)","v":191458923},null,{"$f":"IF($O$2=$O$3,\"OK\",$O$2-$O$3)","v":"OK"}]
[]
["伝票ヘッダ",null,null,null,null,"伝票明細"]
[0,"転記日付","参照伝票番号","伝   票   摘   要","取引先","明細\nNo.","部課\nコード","部課\n名称","ソートキー","貸借","得意先または\n仕入先コード","得意先または\n仕入先名称","勘定\nコード","勘定名称","金   額(税込)","税","支払日/\n入金日","支払\n方法","明     細     摘     要"]
[1,20220613,"No.15","フジワークス",null,1,"SU-0200","運送",null,"借方",null,"",351260,"原価-福利厚生費",12100,"AA",null,null,"フジワークス　雨合羽６枚"]
[1,null,null,null,null,2,null,"","消込","貸方","SU-000043","(株)フジワーク",148100,"仮払金",12100,null,20220615,"T","フジワークス　雨合羽６枚"]
[1,null,null,null,null,null,null,null,null,null,null,null,null,"借方合計",{"$f":"SUMIF(J7:J8,\"借方\",O7:O8)","v":12100}]
[1,null,null,null,null,null,null,null,null,null,null,null,null,"貸方合計",{"$f":"SUMIF(J7:J8,\"貸方\",O7:O8)","v":12100}]
[2,20220615,"No.21","小口現金補充",null,1,null,"",null,"借方",null,"",100020,"小口現金",442512,null,null,null,"小口現金補充"]
[2,null,null,null,null,2,null,"",null,"貸方",null,"",111012,"銀行01-普通",442512,null,null,null,"小口現金補充"]
[2,null,null,null,null,null,null,null,null,null,null,null,null,"借方合計",{"$f":"SUMIF(J11:J12,\"借方\",O11:O12)","v":442512}]
[2,null,null,null,null,null,null,null,null,null,null,null,null,"貸方合計",{"$f":"SUMIF(J11:J12,\"貸方\",O11:O12)","v":442512}]
[3,20220616,"No.29","さつき工業協同組合",null,1,"SU-0200","運送",null,"借方",null,"",351900,"原価-旅費交通費",3780505,"AA",null,null,"さつき工業協同組合　５月ETC使用料　確定"]
[3,null,null,null,null,2,"SU-0200","運送",null,"借方",null,"",352800,"原価-会費",1000,null,null,null,"さつき工業協同組合　５月共済会費"]
[3,null,null,null,null,3,null,"",null,"貸方","SU-000025","さつき工業協同組合",415100,"未払費用",3781505,null,20220701,"D","さつき工業協同組合　５月ETC使用料　確定"]
[3,null,null,null,null,null,null,null,null,null,null,null,null,"借方合計",{"$f":"SUMIF(J15:J17,\"借方\",O15:O17)","v":3781505}]
[3,null,null,null,null,null,null,null,null,null,null,null,null,"貸方合計",{"$f":"SUMIF(J15:J17,\"貸方\",O15:O17)","v":3781505}]
[4,20220620,"No.36","神奈川県自動車交通共済",null,1,null,"",null,"借方",null,"",142102,"前払金",50000,null,null,null,"神奈川県自動車交通共済　１０回中１回目"]
[4,null,null,null,null,2,null,"",null,"貸方","SU-000018","神奈川県自動車交通共済協同組合",415100,"未払費用",50000,null,20220731,"D","神奈川県自動車交通共済　１０回中１回目"]
[4,null,null,null,null,null,null,null,null,null,null,null,null,"借方合計",{"$f":"SUMIF(J20:J21,\"借方\",O20:O21)","v":50000}]
[4,null,null,null,null,null,null,null,null,null,null,null,null,"貸方合計",{"$f":"SUMIF(J20:J21,\"貸方\",O20:O21)","v":50000}]
[5,20220622,"No.41","小口現金補充",null,1,null,"",null,"借方",null,"",100020,"小口現金",482711,null,null,null,"小口現金補充"]
[5,null,null,null,null,2,null,"",null,"貸方",null,"",111012,"銀行01-普通",482711,null,null,null,"小口現金補充"]
[5,null,null,null,null,null,null,null,null,null,null,null,null,"借方合計",{"$f":"SUMIF(J24:J25,\"借方\",O24:O25)","v":482711}]
[5,null,null,null,null,null,null,null,null,null,null,null,null,"貸方合計",{"$f":"SUMIF(J24:J25,\"貸方\",O24:O25)","v":482711}]
[6,20220622,"No.42","三菱HCビジネス",null,1,"SU-0400","川崎営業所",null,"借方",null,"",351600,"原価-賃借料",83592,"A8",null,null,"三菱HCビジネスリース　川崎　サーバーリース"]
[6,null,null,null,null,2,null,"",null,"貸方","SU-000082","三菱HCビジネスリース㈱",415100,"未払費用",83592,null,20220630,"T","三菱HCビジネスリース　川崎　サーバーリース"]
[6,null,null,null,null,null,null,null,null,null,null,null,null,"借方合計",{"$f":"SUMIF(J28:J29,\"借方\",O28:O29)","v":83592}]
[6,null,null,null,null,null,null,null,null,null,null,null,null,"貸方合計",{"$f":"SUMIF(J28:J29,\"貸方\",O28:O29)","v":83592}]
[7,20220622,"No.43","ANT企業年金",null,1,null,"",null,"借方","SU-000001","ANT企業年金基金",415100,"未払費用",1325,null,20220630,"D","ANT企業年金基金　退職金部分　差額調整"]
[7,null,null,null,null,2,"SU-0200","運送",null,"貸方",null,"",351240,"原価-退職給付費用",1325,null,null,null,"ANT企業年金基金　退職金部分　差額調整"]
[7,null,null,null,null,3,null,"",null,"借方","SU-000001","ANT企業年金基金",415100,"未払費用",6520,null,20220630,"D","ANT企業年金基金　年金部分　差額調整"]
[7,null,null,null,null,4,"SU-0200","運送",null,"貸方",null,"",351260,"原価-福利厚生費",6520,null,null,null,"ANT企業年金基金　年金部分　差額調整"]
[7,null,null,null,null,null,null,null,null,null,null,null,null,"借方合計",{"$f":"SUMIF(J32:J35,\"借方\",O32:O35)","v":7845}]
[7,null,null,null,null,null,null,null,null,null,null,null,null,"貸方合計",{"$f":"SUMIF(J32:J35,\"貸方\",O32:O35)","v":7845}]
[8,20220622,"No.44","ANT企業年金",null,1,null,"","消込","借方","SU-000001","ANT企業年金基金",148100,"仮払金",232261,null,null,null,"ANT企業年金基金　退職金部分　振替5-117"]
[8,null,null,null,null,2,null,"","消込","借方","SU-000001","ANT企業年金基金",148100,"仮払金",311360,null,null,null,"ANT企業年金基金　年金部分　振替5-118"]
[8,null,null,null,null,3,null,"","消込","貸方","SU-000001","ANT企業年金基金",415100,"未払費用",7845,null,null,null,"ANT企業年金基金　退職金部分　振替5-117"]
[8,null,null,null,null,4,null,"",null,"貸方",null,"",100500,"UFJ当座",535776,null,20220630,"D","ANT企業年金基金　退職金部分　振替5-117"]
[8,null,null,null,null,null,null,null,null,null,null,null,null,"借方合計",{"$f":"SUMIF(J38:J41,\"借方\",O38:O41)","v":543621}]
[8,null,null,null,null,null,null,null,null,null,null,null,null,"貸方合計",{"$f":"SUMIF(J38:J41,\"貸方\",O38:O41)","v":543621}]
[9,20220622,"No.45","アフラック保険",null,1,null,"",null,"借方",null,"",417199,"預り金その他",82878,null,null,null,"アフラック保険　６月分　従業員預り金"]
[9,null,null,null,null,2,null,null,null,"貸方",null,null,827910,"管理-雑費金融",330,"AA",null,null,"アフラック保険　６月分　振込手数料"]
[9,null,null,null,null,3,null,null,null,"貸方",null,null,865710,"外収その他",2735,"UA",null,null,"アフラック保険　６月分　事務手数料"]
[9,null,null,null,null,4,null,"",null,"貸方","SU-000011","アフラック保険",415100,"未払費用",79813,null,20220731,"T","アフラック保険　６月分　従業員預り金"]
[9,null,null,null,null,null,null,null,null,null,null,null,null,"借方合計",{"$f":"SUMIF(J44:J47,\"借方\",O44:O47)","v":82878}]
[9,null,null,null,null,null,null,null,null,null,null,null,null,"貸方合計",{"$f":"SUMIF(J44:J47,\"貸方\",O44:O47)","v":82878}]
[10,20220623,"No.48","鶴見年金事務所",null,1,null,"",null,"借方",null,"",148100,"仮払金",3575256,null,null,null,"鶴見年金事務所　５月　会社負担分　"]
[10,null,null,null,null,2,null,"",null,"貸方",null,"",415100,"未払費用",1822116,null,20220630,"D","鶴見年金事務所　５月　会社負担分　振替5-116"]
[10,null,null,null,null,3,null,"",null,"貸方",null,"",415100,"未払費用",1753140,null,20220630,"D","鶴見年金事務所　５月　個人負担分　振替6-30"]
[10,null,null,null,null,null,null,null,null,null,null,null,null,"借方合計",{"$f":"SUMIF(J50:J52,\"借方\",O50:O52)","v":3575256}]
[10,null,null,null,null,null,null,null,null,null,null,null,null,"貸方合計",{"$f":"SUMIF(J50:J52,\"貸方\",O50:O52)","v":3575256}]
[11,20220623,"No.49","日新健保組合",null,1,null,"",null,"借方",null,"",148100,"仮払金",2144620,null,null,null,"日新健保組合　５月　会社負担分"]
[11,null,null,null,null,2,null,"",null,"貸方",null,"",415100,"未払費用",1164007,null,20220630,"T","日新健保組合　５月　会社負担分　振替5-115"]
[11,null,null,null,null,3,null,"",null,"貸方",null,"",415100,"未払費用",980613,null,20220630,"T","日新健保組合　５月　個人負担分　振替6-30"]
[11,null,null,null,null,null,null,null,null,null,null,null,null,"借方合計",{"$f":"SUMIF(J55:J57,\"借方\",O55:O57)","v":2144620}]
[11,null,null,null,null,null,null,null,null,null,null,null,null,"貸方合計",{"$f":"SUMIF(J55:J57,\"貸方\",O55:O57)","v":2144620}]
[12,20220623,"No.51","フジワークス",null,1,null,"",null,"借方",null,"",351260,"原価-福利厚生費",4059,"AA",null,null,"フジワーク　安全靴　１足"]
[12,null,null,null,null,2,null,"",null,"貸方","SU-000043","(株)フジワーク",415100,"未払費用",4059,null,20220630,"T","フジワーク　安全靴　１足"]
[12,null,null,null,null,null,null,null,null,null,null,null,null,"借方合計",{"$f":"SUMIF(J60:J61,\"借方\",O60:O61)","v":4059}]
[12,null,null,null,null,null,null,null,null,null,null,null,null,"貸方合計",{"$f":"SUMIF(J60:J61,\"貸方\",O60:O61)","v":4059}]
[13,20220624,"No.57","神奈川県自動車交通共済",null,1,null,"",null,"借方",null,"",148100,"仮払金",null,null,null,null,"神奈川県自動車交通共済　分割払初回金　7/1～"]
[13,null,null,null,null,2,null,"",null,"貸方","SU-000018","神奈川県自動車交通共済協同組合",415100,"未払費用",null,null,20220630,null,"神奈川県自動車交通共済　分割払初回金　7/1～"]
[13,null,null,null,null,null,null,null,null,null,null,null,null,"借方合計",{"$f":"SUMIF(J64:J65,\"借方\",O64:O65)","v":0}]
[13,null,null,null,null,null,null,null,null,null,null,null,null,"貸方合計",{"$f":"SUMIF(J64:J65,\"貸方\",O64:O65)","v":0}]
[14,20220624,"No.58","東京ガス",null,1,"SU-0100","本社",null,"借方",null,"",825200,"管理-光熱水道費",18860,"AA",null,null,"東京ガス　６月　ガス使用料"]
[14,null,null,null,null,2,null,"",null,"貸方","SU-000035","東京ガス(株)",415100,"未払費用",18860,null,20220706,"D","東京ガス　６月　ガス使用料"]
[14,null,null,null,null,null,null,null,null,null,null,null,null,"借方合計",{"$f":"SUMIF(J68:J69,\"借方\",O68:O69)","v":18860}]
[14,null,null,null,null,null,null,null,null,null,null,null,null,"貸方合計",{"$f":"SUMIF(J68:J69,\"貸方\",O68:O69)","v":18860}]
[15,20220627,"No.66","富士フィルムビジネス",null,1,"SU-0100","本社",null,"借方",null,"",827900,"管理-雑費",12645,"AA",null,null,"富士フィルムビジネス　本社　６月トータルサービス"]
[15,null,null,null,null,2,"SU-0400","川崎営業所",null,"借方",null,"",352900,"原価-雑費",9842,"AA",null,null,"富士フィルムビジネス　川崎　６月トータルサービス"]
[15,null,null,null,null,3,"SU-0200","運送",null,"借方",null,"",352900,"原価-雑費",4400,"AA",null,null,"富士フィルムビジネス　業務　６月トータルサービス"]
[15,null,null,null,null,4,null,"",null,"貸方","SU-000067","富士フィルムビジネス",415100,"未払費用",26887,null,20220715,"T","富士フィルムビジネス　　６月トータルサービス"]
[15,null,null,null,null,null,null,null,null,null,null,null,null,"借方合計",{"$f":"SUMIF(J72:J75,\"借方\",O72:O75)","v":26887}]
[15,null,null,null,null,null,null,null,null,null,null,null,null,"貸方合計",{"$f":"SUMIF(J72:J75,\"貸方\",O72:O75)","v":26887}]
[16,20220627,"No.67","神奈川県自動車交通共済",null,1,null,"",null,"借方","SU-000018","神奈川県自動車交通共済協同組合",145100,"未収入金",95595,null,null,null,"神奈川県自動車交通共済　配当金　手取り額"]
[16,null,null,null,null,2,null,"",null,"借方",null,"",981000,"法人税",255,null,null,null,"神奈川県自動車交通共済　配当金　源泉徴収税"]
[16,null,null,null,null,3,null,null,null,"貸方",null,null,862000,"受取配当金",1250,null,null,null,"神奈川県自動車交通共済　出資配当金"]
[16,null,null,null,null,4,null,"",null,"貸方",null,"",865710,"外収その他",94600,"U0",null,null,"神奈川県自動車交通共済　利用分量配当金"]
[16,null,null,null,null,null,null,null,null,null,null,null,null,"借方合計",{"$f":"SUMIF(J78:J81,\"借方\",O78:O81)","v":95850}]
[16,null,null,null,null,null,null,null,null,null,null,null,null,"貸方合計",{"$f":"SUMIF(J78:J81,\"貸方\",O78:O81)","v":95850}]
[17,20220627,"No.68","神奈川県自動車交通共済",null,1,null,"",null,"借方","SU-000018","神奈川県自動車交通共済協同組合",145100,"未収入金",111679,null,20220705,"T","神奈川県自動車交通共済　配当金　手取り額"]
[17,null,null,null,null,2,null,"",null,"借方",null,"",981000,"法人税",3011,null,null,null,"神奈川県自動車交通共済　配当金　源泉徴収税"]
[17,null,null,null,null,3,null,null,null,"貸方",null,null,862000,"受取配当金",14750,null,null,null,"神奈川県自動車交通共済　出資配当金"]
[17,null,null,null,null,4,null,"",null,"貸方",null,"",865710,"外収その他",99940,"U0",null,null,"神奈川県自動車交通共済　利用分量配当金"]
[17,null,null,null,null,null,null,null,null,null,null,null,null,"借方合計",{"$f":"SUMIF(J84:J87,\"借方\",O84:O87)","v":114690}]
[17,null,null,null,null,null,null,null,null,null,null,null,null,"貸方合計",{"$f":"SUMIF(J84:J87,\"貸方\",O84:O87)","v":114690},null,null,null,"　"]
[18,20220623,"No.69","昭和日タン株式会社",null,1,null,"",null,"借方",null,"",100500,"UFJ当座",133695,null,null,null,"昭和日タン株式会社　配当金　手取り額"]
[18,null,null,null,null,2,null,"",null,"借方",null,"",981000,"法人税",34305,null,null,null,"昭和日タン株式会社　配当金　源泉徴収税"]
[18,null,null,null,null,3,null,"",null,"貸方",null,null,862000,"受取配当金",168000,null,null,null,"昭和日タン株式会社　配当金　"]
[18,null,null,null,null,null,null,null,null,null,null,null,null,"借方合計",{"$f":"SUMIF(J90:J92,\"借方\",O90:O92)","v":168000}]
[18,null,null,null,null,null,null,null,null,null,null,null,null,"貸方合計",{"$f":"SUMIF(J90:J92,\"貸方\",O90:O92)","v":168000}]
[19,20220627,"No.70","神奈川銀行",null,1,null,"",null,"借方",null,"",100500,"UFJ当座",223262,null,null,null,"神奈川銀行　配当金　手取り額"]
[19,null,null,null,null,2,null,"",null,"借方",null,"",981000,"法人税",57288,null,null,null,"神奈川銀行　配当金　源泉徴収税"]
[19,null,null,null,null,3,null,"",null,"貸方",null,"",862000,"受取配当金",280550,null,null,null,"神奈川銀行　配当金　"]
[19,null,null,null,null,null,null,null,null,null,null,null,null,"借方合計",{"$f":"SUMIF(J95:J97,\"借方\",O95:O97)","v":280550}]
[19,null,null,null,null,null,null,null,null,null,null,null,null,"貸方合計",{"$f":"SUMIF(J95:J97,\"貸方\",O95:O97)","v":280550}]
[20,20220627,"No.71","旧・新栄運輸",null,1,null,"",null,"借方",null,"",100500,"UFJ当座",14949,null,20220630,"T","旧・新栄運輸　筒井社長　住民税・アフラック６月"]
[20,null,null,null,null,2,null,"",null,"貸方",null,"",417199,"預り金その他",6200,null,null,null,"旧・新栄運輸　筒井社長　住民税６月"]
[20,null,null,null,null,3,null,"",null,"貸方",null,"",417199,"預り金その他",8749,null,null,null,"旧・新栄運輸　筒井社長　アフラック保険"]
[20,null,null,null,null,null,null,null,null,null,null,null,null,"借方合計",{"$f":"SUMIF(J100:J102,\"借方\",O100:O102)","v":14949}]
[20,null,null,null,null,null,null,null,null,null,null,null,null,"貸方合計",{"$f":"SUMIF(J100:J102,\"貸方\",O100:O102)","v":14949}]
[21,20220627,"No.78","神奈川県トラック協会",null,1,"SU-0100","本社",null,"借方",null,"",826900,"管理-会費",24000,null,null,null,"（一）神奈川県トラック協会　タンクトラック部会費"]
[21,null,null,null,null,2,null,"",null,"貸方",null,"",415100,"未払費用",24000,null,20220731,"T","（一）神奈川県トラック協会　タンクトラック部会費"]
[21,null,null,null,null,null,null,null,null,null,null,null,null,"借方合計",{"$f":"SUMIF(J105:J106,\"借方\",O105:O106)","v":24000}]
[21,null,null,null,null,null,null,null,null,null,null,null,null,"貸方合計",{"$f":"SUMIF(J105:J106,\"貸方\",O105:O106)","v":24000}]
[22,20220630,"No.79","小口現金補充",null,1,null,"",null,"借方",null,"",100020,"小口現金",378545,null,null,null,"小口現金補充"]
[22,null,null,null,null,2,null,"",null,"貸方",null,"",111012,"銀行01-普通",378545,null,null,null,"小口現金補充"]
[22,null,null,null,null,null,null,null,null,null,null,null,null,"借方合計",{"$f":"SUMIF(J109:J110,\"借方\",O109:O110)","v":378545}]
[22,null,null,null,null,null,null,null,null,null,null,null,null,"貸方合計",{"$f":"SUMIF(J109:J110,\"貸方\",O109:O110)","v":378545}]
[23,20220630,"No.82","城南信金資金移動",null,1,null,"",null,"借方",null,"",111012,"銀行01-普通",null,null,null,null,"城南信金資金移動　月初200万円"]
[23,null,null,null,null,2,null,"",null,"貸方",null,"",142102,"前払金",null,null,null,null,"城南信金資金移動　月初200万円"]
[23,null,null,null,null,null,null,null,null,null,null,null,null,"借方合計",{"$f":"SUMIF(J113:J114,\"借方\",O113:O114)","v":0}]
[23,null,null,null,null,null,null,null,null,null,null,null,null,"貸方合計",{"$f":"SUMIF(J113:J114,\"貸方\",O113:O114)","v":0}]
[24,20220630,"No.83","日新　経理事務手数料",null,1,"SU-0100","本社",null,"借方",null,"",825120,"管理-外部委託費",55000,"AA",null,null,"日新　６月　経理事務手数料"]
[24,null,null,null,null,2,null,"",null,"貸方","SU-0Z0100","(株)日新",415100,"未払費用",55000,null,20220731,"T","日新　６月　経理事務手数料"]
[24,null,null,null,null,null,null,null,null,null,null,null,null,"借方合計",{"$f":"SUMIF(J117:J118,\"借方\",O117:O118)","v":55000}]
[24,null,null,null,null,null,null,null,null,null,null,null,null,"貸方合計",{"$f":"SUMIF(J117:J118,\"貸方\",O117:O118)","v":55000}]
[25,20220630,"No.84","日新　社長人件費",null,1,"SU-0100","本社",null,"借方",null,"",824100,"管理-役員報酬",858345,null,null,null,"日新　６月　社長人件費"]
[25,null,null,null,null,2,"SU-0100","本社",null,"借方",null,"",824320,"管理-通勤費",43655,"AA",null,null,"日新　６月　社長通勤費"]
[25,null,null,null,null,3,null,"",null,"貸方","SU-0Z0100","(株)日新",415100,"未払費用",902000,null,20220731,"T","日新　６月　社長人件費・通勤費"]
[25,null,null,null,null,null,null,null,null,null,null,null,null,"借方合計",{"$f":"SUMIF(J121:J123,\"借方\",O121:O123)","v":902000}]
[25,null,null,null,null,null,null,null,null,null,null,null,null,"貸方合計",{"$f":"SUMIF(J121:J123,\"貸方\",O121:O123)","v":902000}]
[26,20220630,"No.86","全国ビジネスネットワーク",null,1,"SU-0100","本社",null,"借方",null,"",826900,"管理-会費",3000,"AA",null,null,"全国ビジネスネットワーク　労災上乗せ保険　年会費"]
[26,null,null,null,null,2,null,"",null,"貸方",null,"",415100,"未払費用",3000,null,20220731,"T","全国ビジネスネットワーク　労災上乗せ保険　年会費"]
[26,null,null,null,null,null,null,null,null,null,null,null,null,"借方合計",{"$f":"SUMIF(J126:J127,\"借方\",O126:O127)","v":3000}]
[26,null,null,null,null,null,null,null,null,null,null,null,null,"貸方合計",{"$f":"SUMIF(J126:J127,\"貸方\",O126:O127)","v":3000}]
[27,20220630,"No.87","楽天市場",null,1,"SU-0200","運送",null,"借方",null,"",352900,"原価-雑費",29017,"AA",null,null,"楽天市場　6/27 運転員飲料水"]
[27,null,null,"国土交通省",null,2,"SU-0200","運送",null,"借方",null,"",352900,"原価-雑費",10400,"A0",null,null,"国土交通省　中部地区 特車通行料"]
[27,null,null,"カインズ市原",null,3,"SU-0200","運送",null,"借方",null,"",352410,"原価-備品",2360,"AA",null,null,"カインズ市原　ジョイントケース２個"]
[27,null,null,"エネクスフリート",null,4,"SU-0200","運送","油脂費","借方",null,"",351000,"売上原価",1320,"AA",null,null,"油脂費　アドブルー #158 10L"]
[27,null,null,"モノタロウ",null,5,"SU-0200","運送",null,"借方",null,"",352410,"原価-備品",7681,"AA",null,null,"モノタロウ 6/26 エタノールアミン用ゴム"]
[27,null,null,null,null,6,null,"",null,"貸方",null,"",415100,"未払費用",50778,null,20220701,"A","小口未精算"]
[27,null,null,null,null,null,null,null,null,null,null,null,null,"借方合計",{"$f":"SUMIF(J130:J135,\"借方\",O130:O135)","v":50778}]
[27,null,null,null,null,null,null,null,null,null,null,null,null,"貸方合計",{"$f":"SUMIF(J130:J135,\"貸方\",O130:O135)","v":50778}]
[28,20220630,"No.88","京浜特坊協",null,1,"SU-0400","川崎営業所",null,"借方",null,"",352800,"原価-会費",13220,"AA",null,null,"京浜特坊協　年会費"]
[28,null,null,"川危連絡協議会",null,2,"SU-0400","川崎営業所",null,"借方",null,"",352800,"原価-会費",12385,"AA",null,null,"川危連絡協議会　年会費"]
[28,null,null,"大塚商会",null,3,"SU-0400","川崎営業所",null,"借方",null,"",351600,"原価-賃借料",4180,"AA",null,null,"大塚商会　５月メールサーバー利用料"]
[28,null,null,"ドンキホーテ",null,4,"SU-0400","川崎営業所",null,"借方",null,"",352410,"原価-備品",11919,"AA",null,null,"ドンキホーテ　ＬＥＤ直管ほか"]
[28,null,null,"ノジマ",null,5,"SU-0400","川崎営業所",null,"借方",null,"",352420,"原価-事務用品代",2926,"AA",null,null,"ノジマ　ＰＣマウス代"]
[28,null,null,"コーナン",null,6,"SU-0400","川崎営業所",null,"借方",null,"",352410,"原価-備品",50682,"AA",null,null,"コーナン　冷蔵庫３台"]
[28,null,null,"ヤマダ電機",null,7,"SU-0400","川崎営業所",null,"借方",null,"",352420,"原価-事務用品代",9578,"AA",null,null,"ヤマダ電機　ＰＣ周辺機器"]
[28,null,null,"ビッグエー",null,8,"SU-0400","川崎営業所",null,"借方",null,"",352900,"原価-雑費",1995,"AA",null,null,"ビッグエー　アクエリアスほか"]
[28,null,null,"オーケー",null,9,"SU-0400","川崎営業所",null,"借方",null,"",352900,"原価-雑費",1645,"AA",null,null,"オーケー　スポーツドリンク代"]
[28,null,null,"島忠ホームズ",null,10,"SU-0400","川崎営業所",null,"借方",null,"",352410,"原価-備品",34070,"AA",null,null,"島忠ホームズ　板材ほか"]
[28,null,null,"丸五商店",null,11,"SU-0400","川崎営業所",null,"借方",null,"",351900,"原価-旅費交通費",6598,"AA",null,null,"丸五商店　連絡車　燃料代"]
[28,null,null,null,null,12,null,"",null,"貸方",null,"",415100,"未払費用",149198,null,20220704,"A","川崎営業所　小口未精算"]
[28,null,null,null,null,null,null,null,null,null,null,null,null,"借方合計",{"$f":"SUMIF(J138:J149,\"借方\",O138:O149)","v":149198}]
[28,null,null,null,null,null,null,null,null,null,null,null,null,"貸方合計",{"$f":"SUMIF(J138:J149,\"貸方\",O138:O149)","v":149198}]
[29,20220630,"No.89","石綿商店　",null,1,"SU-0400","川崎営業所",null,"借方",null,"",352900,"原価-雑費",16500,"AA",null,null,"石綿商店　５月分　廃棄物処理費"]
[29,null,null,null,null,2,null,"",null,"貸方","SU-000012","(株)石綿商店",415100,"未払費用",16500,null,20220731,"T","石綿商店　５月分　廃棄物処理費"]
[29,null,null,"スズヨシガス",null,3,"SU-0400","川崎営業所",null,"借方",null,"",351300,"原価-光熱水道費",9944,"AA",null,null,"スズヨシガス　６月　ガス使用料"]
[29,null,null,null,null,4,null,"",null,"貸方","SU-000090","#N/A",415100,"未払費用",9944,null,20220731,"T","スズヨシガス　６月　ガス使用料"]
[29,null,null,"モノタロウ",null,5,"SU-0400","川崎営業所",null,"借方",null,"",352900,"原価-雑費",15378,"AA",null,null,"モノタロウ　６月　セーフレーン他"]
[29,null,null,null,null,6,null,"",null,"貸方","SU-000105","モノタロウ",415100,"未払費用",15378,null,20220731,"T","モノタロウ　６月　セーフレーン他"]
[29,null,null,"ロイヤル警備保障",null,7,"SU-0400","川崎営業所",null,"借方",null,"",352900,"原価-雑費",713666,"AA",null,null,"ロイヤル警備保障　６月　夜間警備代"]
[29,null,null,null,null,8,null,"",null,"貸方","SU-000051","ロイヤル警備保障",415100,"未払費用",713666,null,20220731,"T","ロイヤル警備保障　６月　夜間警備代"]
[29,null,null,"ユニマットライフ",null,9,"SU-0400","川崎営業所",null,"借方",null,"",352410,"原価-備品",38968,"AA",null,null,"ユニマットライフ　５月６月　マット代"]
[29,null,null,null,null,10,null,"",null,"貸方",null,"",415100,"未払費用",38968,null,20220731,"T","ユニマットライフ　５月６月　マット代"]
[29,null,null,"第一法規",null,11,"SU-0400","川崎営業所",null,"借方",null,"",352900,"原価-雑費",4394,"AA",null,null,"第一法規　６月　危険物法令集追補版"]
[29,null,null,null,null,12,null,"",null,"貸方","SU-000084","第一法規㈱",415100,"未払費用",4394,null,20220731,"T","第一法規　６月　危険物法令集追補版"]
[29,null,null,"マクタ",null,13,"SU-0400","川崎営業所",null,"借方",null,"",352900,"原価-雑費",132242,"AA",null,null,"マクタ　燐酸用ホース、ノズル"]
[29,null,null,null,null,14,null,"",null,"貸方","SU-000046","(株)マクタ",415100,"未払費用",132242,null,20220731,"T","マクタ　燐酸用ホース、ノズル"]
[29,null,null,"トヨタエルアンドエフ",null,15,"SU-0400","川崎営業所",null,"借方",null,"",352900,"原価-雑費",330550,"AA",null,null,"トヨタエルアンドエフ　フォークリフト点検代"]
[29,null,null,null,null,16,null,"",null,"貸方","SU-000038","ﾄﾖﾀｴﾙ＆ｴﾌ神奈川(株)",415100,"未払費用",330550,null,20220731,"T","トヨタエルアンドエフ　フォークリフト点検代"]
[29,null,null,null,null,null,null,null,null,null,null,null,null,"借方合計",{"$f":"SUMIF(J152:J167,\"借方\",O152:O167)","v":1261642}]
[29,null,null,null,null,null,null,null,null,null,null,null,null,"貸方合計",{"$f":"SUMIF(J152:J167,\"貸方\",O152:O167)","v":1261642}]
[30,20220630,"No.90","広栄商会",null,1,"SU-0200","運送",null,"借方",null,"",351900,"原価-旅費交通費",36287,"AA",null,null,"広栄商会　６月　ガソリン代"]
[30,null,null,null,null,2,null,"",null,"貸方","SU-000022","(株)広栄商会",415100,"未払費用",36287,null,20220731,"T","広栄商会　６月　ガソリン代"]
[30,null,null,null,null,null,null,null,null,null,null,null,null,"借方合計",{"$f":"SUMIF(J170:J171,\"借方\",O170:O171)","v":36287}]
[30,null,null,null,null,null,null,null,null,null,null,null,null,"貸方合計",{"$f":"SUMIF(J170:J171,\"貸方\",O170:O171)","v":36287}]
[31,20220630,"No.91","広栄商会",null,1,"SU-0200","運送",null,"借方",null,"",351900,"原価-旅費交通費",19237,"AA",null,null,"広栄商会　６月　連絡車　ガソリン代"]
[31,null,null,null,null,2,"SU-0200","運送",null,"借方",null,"",351700,"原価-保険",161630,"A9",null,null,"広栄商会　６月　自賠責保険"]
[31,null,null,null,null,3,null,"",null,"貸方","SU-000022","(株)広栄商会",415100,"未払費用",180867,null,20220731,"T","広栄商会　６月　連絡車　ガソリン代"]
[31,null,null,null,null,null,null,null,null,null,null,null,null,"借方合計",{"$f":"SUMIF(J174:J176,\"借方\",O174:O176)","v":180867}]
[31,null,null,null,null,null,null,null,null,null,null,null,null,"貸方合計",{"$f":"SUMIF(J174:J176,\"貸方\",O174:O176)","v":180867}]
[32,20220630,"No.92","Special Medico",null,1,"SU-0100","本社",null,"借方",null,"",827900,"管理-雑費",8800,"AA",null,null,"Special Medico　産業医紹介費"]
[32,null,null,null,null,2,null,"",null,"貸方",null,"",415100,"未払費用",8800,null,20220731,"T","Special Medico　産業医紹介費"]
[32,null,null,null,null,null,null,null,null,null,null,null,null,"借方合計",{"$f":"SUMIF(J179:J180,\"借方\",O179:O180)","v":8800}]
[32,null,null,null,null,null,null,null,null,null,null,null,null,"貸方合計",{"$f":"SUMIF(J179:J180,\"貸方\",O179:O180)","v":8800}]
[33,20220630,"No.93","奥山　輝雄",null,1,"SU-0100","本社",null,"借方",null,"",827900,"管理-雑費",40000,null,null,null,"奥山　輝雄　６月　産業医基本料"]
[33,null,null,"奥山　輝雄",null,2,"SU-0100","本社",null,"借方",null,"",826200,"管理-旅費交通費",1190,"AA",null,null,"奥山　輝雄　６月　交通費（当社まで）"]
[33,null,null,null,null,3,null,"",null,"貸方",null,"",415100,"未払費用",39965,null,20220731,"T","振込金額"]
[33,null,null,null,null,4,null,"",null,"貸方",null,"",417199,"預り金その他",1225,null,null,null,"預り金（源泉所得税）"]
[33,null,null,null,null,null,null,null,null,null,null,null,null,"借方合計",{"$f":"SUMIF(J183:J186,\"借方\",O183:O186)","v":41190}]
[33,null,null,null,null,null,null,null,null,null,null,null,null,"貸方合計",{"$f":"SUMIF(J183:J186,\"貸方\",O183:O186)","v":41190}]
[34,20220630,"No.94","広栄運輸",null,1,"SU-0500","修理",null,"借方","SU-009973","広栄運輸(株)",113100,"売掛金",394790,null,20220731,"T","広栄運輸　６月　社外車　整備費用"]
[34,null,null,null,null,2,null,"","社外車修理収入","貸方",null,"",811100,"売上",394790,"UA",null,null,"広栄運輸　６月　社外車　整備費用"]
[34,null,null,null,null,null,null,null,null,null,null,null,null,"借方合計",{"$f":"SUMIF(J189:J190,\"借方\",O189:O190)","v":394790}]
[34,null,null,null,null,null,null,null,null,null,null,null,null,"貸方合計",{"$f":"SUMIF(J189:J190,\"貸方\",O189:O190)","v":394790}]
[35,20220630,"No.98","横浜市シルバー人材",null,1,"SU-0100","本社",null,"借方",null,"",827900,"管理-雑費",37950,"AA",null,null,"横浜市シルバー人材　６月　清掃費用"]
[35,null,null,null,null,2,null,"",null,"貸方","SU-000049","公益財団法人横浜市シルバー人材センター",415100,"未払費用",37950,null,20220731,"T","横浜市シルバー人材　６月　清掃費用"]
[35,null,null,null,null,null,null,null,null,null,null,null,null,"借方合計",{"$f":"SUMIF(J193:J194,\"借方\",O193:O194)","v":37950}]
[35,null,null,null,null,null,null,null,null,null,null,null,null,"貸方合計",{"$f":"SUMIF(J193:J194,\"貸方\",O193:O194)","v":37950}]
[36,20220630,"No.99","アスクル",null,1,"SU-0200","運送",null,"借方",null,"",352420,"原価-事務用品代",52829,"AA",null,null,"アスクル　６月　事務用品"]
[36,null,null,null,null,2,"SU-0200","運送",null,"借方",null,"",351250,"原価-法定福利費",8887,"K8",null,null,"アスクル　６月　運転員　飴代"]
[36,null,null,null,null,3,null,"",null,"貸方","SU-000096","ASUKL",415100,"未払費用",61716,null,20220706,"A","アスクル　６月　事務用品"]
[36,null,null,null,null,null,null,null,null,null,null,null,null,"借方合計",{"$f":"SUMIF(J197:J199,\"借方\",O197:O199)","v":61716}]
[36,null,null,null,null,null,null,null,null,null,null,null,null,"貸方合計",{"$f":"SUMIF(J197:J199,\"貸方\",O197:O199)","v":61716}]
[37,20220630,"No.100","ミドリ安全",null,1,"SU-0200","運送",null,"借方",null,"",352410,"原価-備品",13442,"AA",null,null,"ミドリ安全　６月　ヘルメット代"]
[37,null,null,null,null,2,null,"",null,"貸方","SU-000099","ミドリ安全株式会社",415100,"未払費用",13442,null,20220706,"A","ミドリ安全　６月　ヘルメット代"]
[37,null,null,null,null,null,null,null,null,null,null,null,null,"借方合計",{"$f":"SUMIF(J202:J203,\"借方\",O202:O203)","v":13442}]
[37,null,null,null,null,null,null,null,null,null,null,null,null,"貸方合計",{"$f":"SUMIF(J202:J203,\"貸方\",O202:O203)","v":13442}]
[38,20220630,"No.101","日新",null,1,"SU-0100","本社",null,"借方",null,"",142102,"前払金",660000,null,null,null,"日新　７月　平安町賃貸"]
[38,null,null,null,null,2,null,"",null,"貸方","SU-0Z0100","(株)日新",415100,"未払費用",660000,null,20220731,"T","日新　７月　平安町賃貸"]
[38,null,null,null,null,null,null,null,null,null,null,null,null,"借方合計",{"$f":"SUMIF(J206:J207,\"借方\",O206:O207)","v":660000}]
[38,null,null,null,null,null,null,null,null,null,null,null,null,"貸方合計",{"$f":"SUMIF(J206:J207,\"貸方\",O206:O207)","v":660000}]
[39,20220630,"No.102","旧・新栄運輸",null,1,null,"",null,"借方","SU-009952","旧.新栄運輸(株)",113100,"売掛金",9209161,null,20220731,"T","旧・新栄運輸　６月売上"]
[39,null,null,null,null,2,"SU-0200","運送",null,"貸方",null,"",811100,"売上",6627991,"UA",null,null,"旧・新栄運輸　６月売上　課税分"]
[39,null,null,null,null,3,"SU-0200","運送",null,"貸方",null,"",811100,"売上",2581170,"U9",null,null,"旧・新栄運輸　６月売上　免税分"]
[39,null,null,null,null,null,null,null,null,null,null,null,null,"借方合計",{"$f":"SUMIF(J210:J212,\"借方\",O210:O212)","v":9209161}]
[39,null,null,null,null,null,null,null,null,null,null,null,null,"貸方合計",{"$f":"SUMIF(J210:J212,\"貸方\",O210:O212)","v":9209161}]
[40,20220630,"No.103","旧・新栄運輸",null,1,"SU-0200","運送",null,"借方",null,"",351000,"売上原価",6832980,"AA",null,null,"旧・新栄運輸　６月原価　課税分"]
[40,null,null,"旧・新栄運輸",null,2,"SU-0200","運送",null,"借方",null,"",351000,"売上原価",2661000,"A9",null,null,"旧・新栄運輸　６月原価　免税分"]
[40,null,null,null,null,3,null,"",null,"貸方","SU-009952","旧.新栄運輸(株)",412100,"買掛金",9493980,null,20220731,"T","旧・新栄運輸　６月原価　"]
[40,null,null,null,null,null,null,null,null,null,null,null,null,"借方合計",{"$f":"SUMIF(J215:J217,\"借方\",O215:O217)","v":9493980}]
[40,null,null,null,null,null,null,null,null,null,null,null,null,"貸方合計",{"$f":"SUMIF(J215:J217,\"貸方\",O215:O217)","v":9493980}]
[41,20220630,"No.104","旧・新栄運輸",null,1,null,"","消込","借方",null,"",412100,"買掛金",9493980,null,null,null,"旧・新栄運輸　６月売上/原価"]
[41,null,null,null,null,2,null,"","消込","貸方",null,"",113100,"売掛金",9209161,null,null,null,"旧・新栄運輸　６月売上/原価"]
[41,null,null,null,null,3,null,"",null,"貸方","SU-009952","旧.新栄運輸(株)",415100,"未払費用",284819,null,20220731,"T","旧・新栄運輸　６月業務委託費用"]
[41,null,null,null,null,null,null,null,null,null,null,null,null,"借方合計",{"$f":"SUMIF(J220:J222,\"借方\",O220:O222)","v":9493980}]
[41,null,null,null,null,null,null,null,null,null,null,null,null,"貸方合計",{"$f":"SUMIF(J220:J222,\"貸方\",O220:O222)","v":9493980}]
[42,20220630,"No.105","旧・新栄運輸",null,1,"SU-0200","運送",null,"借方",null,"",811100,"売上",8872800,null,null,null,"旧・新栄運輸　６月売上/原価　圧縮"]
[42,null,null,null,null,2,"SU-0200","運送",null,"貸方",null,"",351000,"売上原価",8872800,null,null,null,"旧・新栄運輸　６月売上/原価　圧縮"]
[42,null,null,null,null,null,null,null,null,null,null,null,null,"借方合計",{"$f":"SUMIF(J225:J226,\"借方\",O225:O226)","v":8872800}]
[42,null,null,null,null,null,null,null,null,null,null,null,null,"貸方合計",{"$f":"SUMIF(J225:J226,\"貸方\",O225:O226)","v":8872800}]
[43,20220630,"No.106","日新",null,1,"SU-0100","本社",null,"借方",null,"",825500,"管理-賃借料",136400,"AA",null,null,"日新　６月　ＰＣ使用料"]
[43,null,null,null,null,2,"SU-0100","本社",null,"借方",null,"",825500,"管理-賃借料",1100,"AA",null,null,"日新　６月　グーグルアカウント利用料"]
[43,null,null,null,null,3,null,"",null,"貸方","SU-0Z0100","(株)日新",415100,"未払費用",137500,null,20220731,"T","日新　６月　ＰＣ使用料"]
[43,null,null,null,null,null,null,null,null,null,null,null,null,"借方合計",{"$f":"SUMIF(J229:J231,\"借方\",O229:O231)","v":137500}]
[43,null,null,null,null,null,null,null,null,null,null,null,null,"貸方合計",{"$f":"SUMIF(J229:J231,\"貸方\",O229:O231)","v":137500}]
[44,20220630,"No.107","広栄運輸",null,1,null,"",null,"借方",null,"",415100,"未払費用",3377163,null,20220731,"T","広栄運輸　６月　軽油費"]
[44,null,null,null,null,2,"SU-0200","運送","軽油費","貸方",null,"",351000,"売上原価",2440390,"AA",null,null,"広栄運輸　６月　軽油費"]
[44,null,null,null,null,3,"SU-0200","運送","軽油税","貸方",null,"",351000,"売上原価",833899,null,null,null,"広栄運輸　６月　軽油税"]
[44,null,null,null,null,4,"SU-0200","運送","アドブルー","貸方",null,"",351000,"売上原価",102874,"AA",null,null,"広栄運輸　６月　アドブルー"]
[44,null,null,null,null,null,null,null,null,null,null,null,null,"借方合計",{"$f":"SUMIF(J234:J237,\"借方\",O234:O237)","v":3377163}]
[44,null,null,null,null,null,null,null,null,null,null,null,null,"貸方合計",{"$f":"SUMIF(J234:J237,\"貸方\",O234:O237)","v":3377163}]
[45,20220630,"No.108","翔健オートサービス",null,1,null,"",null,"借方","SU-000052","翔健オートサービス",113100,"売掛金",31350,null,20220731,"T","翔健オートサービス　６月　社外車　整備費用"]
[45,null,null,null,null,2,"SU-0500","修理","社外車修理収入","貸方",null,"",811100,"売上",31350,"UA",null,null,"翔健オートサービス　６月　社外車　整備費用"]
[45,null,null,"沢田商事",null,3,null,"",null,"借方","SU-000053","沢田商事",113100,"売掛金",14135,null,20220731,"T","沢田商事　６月　社外車　整備費用"]
[45,null,null,null,null,4,"SU-0500","修理","社外車修理収入","貸方",null,"",811100,"売上",14135,"UA",null,null,"沢田商事　６月　社外車　整備費用"]
[45,null,null,"翔健オートサービス",null,5,null,"",null,"借方","SU-000052","翔健オートサービス",113100,"売掛金",41470,null,20220731,"T","翔健オートサービス　６月　社外車　整備費用"]
[45,null,null,null,null,6,"SU-0500","修理","社外車修理収入","貸方",null,"",811100,"売上",41470,"UA",null,null,"翔健オートサービス　６月　社外車　整備費用"]
[45,null,null,null,null,null,null,null,null,null,null,null,null,"借方合計",{"$f":"SUMIF(J240:J245,\"借方\",O240:O245)","v":86955}]
[45,null,null,null,null,null,null,null,null,null,null,null,null,"貸方合計",{"$f":"SUMIF(J240:J245,\"貸方\",O240:O245)","v":86955}]
[46,20220630,"No.109","日新",null,1,null,"",null,"借方","SU-0Z0100","(株)日新",113100,"売掛金",68835847,null,20220731,"T","日新　６月　運送収入"]
[46,null,null,null,null,2,"SU-0200","運送","自動車収入","貸方",null,"",811100,"売上",39910937,"UA",null,null,"日新　６月　運送収入（課税）"]
[46,null,null,null,null,3,"SU-0200","運送","自動車収入","貸方",null,"",811100,"売上",3091600,"U9",null,null,"日新　６月　運送収入（免税）"]
[46,null,null,null,null,4,"SU-0200","運送","運送雑収入","貸方",null,"",811100,"売上",104000,"U0",null,null,"日新　６月　保険収入"]
[46,null,null,null,null,5,"SU-0400","川崎営業所","作業管理収入","貸方",null,"",811100,"売上",7915897,"UA",null,null,"日新　６月　川崎タンクヤード　作業管理収入"]
[46,null,null,null,null,6,"SU-0300","庸車","傭車収入","貸方",null,"",811100,"売上",15844188,"UA",null,null,"日新　６月　傭車収入（課税）"]
[46,null,null,null,null,7,"SU-0300","庸車","傭車収入","貸方",null,"",811100,"売上",1969225,"U9",null,null,"日新　６月　傭車収入（免税）"]
[46,null,null,"内外液輸",null,8,null,"",null,"借方","SU-000040","内外液輸株式会社",113100,"売掛金",4711850,null,20220731,"T","内外液輸　６月　運送収入"]
[46,null,null,null,null,9,"SU-0200","運送","自動車収入","貸方",null,"",811100,"売上",4139520,"UA",null,null,"内外液輸　６月　運送収入（課税）"]
[46,null,null,null,null,10,"SU-0300","庸車","自動車収入","貸方",null,"",811100,"売上",572330,"UA",null,null,"内外液輸　６月　傭車収入（課税）"]
[46,null,null,"交神運輸",null,11,null,"",null,"借方","SU-000023","交神運輸㈱",113100,"売掛金",170500,null,20220731,"T","交神運輸　６月　運送収入（課税）"]
[46,null,null,null,null,12,"SU-0200","運送","自動車収入","貸方",null,"",811100,"売上",170500,"UA",null,null,"交神運輸　６月　運送収入（課税）"]
[46,null,null,"トランコム",null,13,null,"",null,"借方","SU-000039","トランコム株式会社",113100,"売掛金",245300,null,20220731,"T","トランコム　６月　運送収入（課税）"]
[46,null,null,null,null,14,"SU-0200","運送","自動車収入","貸方",null,"",811100,"売上",245300,"UA",null,null,"トランコム　６月　運送収入（課税）"]
[46,null,null,"国際コンテナ輸送",null,15,null,"",null,"借方","SU-000024","国際コンテナ運輸株式会社",113100,"売掛金",2947650,null,20220731,"T","国際コンテナ輸送　６月　運送収入"]
[46,null,null,null,null,16,"SU-0200","運送","自動車収入","貸方",null,"",811100,"売上",1838650,"UA",null,null,"国際コンテナ輸送　６月　運送収入（課税）"]
[46,null,null,null,null,17,"SU-0200","運送","自動車収入","貸方",null,"",811100,"売上",790000,"U9",null,null,"国際コンテナ輸送　６月　運送収入（免税）"]
[46,null,null,null,null,18,"SU-0300","庸車","傭車収入","貸方",null,"",811100,"売上",319000,"UA",null,null,"国際コンテナ輸送　６月　傭車収入（課税）"]
[46,null,null,null,null,null,null,null,null,null,null,null,null,"借方合計",{"$f":"SUMIF(J248:J265,\"借方\",O248:O265)","v":76911147}]
[46,null,null,null,null,null,null,null,null,null,null,null,null,"貸方合計",{"$f":"SUMIF(J248:J265,\"貸方\",O248:O265)","v":76911147}]
[47,20220630,"No.110","日新",null,1,"SU-0200","運送",null,"借方",null,"",351600,"原価-賃借料",124821,"AA",null,null,"日新　６月　タンクリース代"]
[47,null,null,null,null,2,null,"",null,"貸方","SU-0Z0100","(株)日新",415100,"未払費用",124821,null,20220731,"T","日新　６月　タンクリース代"]
[47,null,null,null,null,3,"SU-0200","運送",null,"借方",null,"",351600,"原価-賃借料",110000,"AA",null,null,"日新　６月　新興倉庫駐車料"]
[47,null,null,null,null,4,null,"",null,"貸方","SU-0Z0100","(株)日新",415100,"未払費用",110000,null,20220731,"T","日新　６月　新興倉庫駐車料"]
[47,null,null,null,null,5,"SU-0200","運送",null,"借方",null,"",351600,"原価-賃借料",11000,"AA",null,null,"日新　６月　コンテナシャーシ"]
[47,null,null,null,null,6,null,"",null,"貸方","SU-0Z0100","(株)日新",415100,"未払費用",11000,null,20220731,"T","日新　６月　コンテナシャーシ"]
[47,null,null,null,null,7,"SU-0200","運送",null,"借方",null,"",142102,"前払金",988416,null,null,null,"日新　7月　寛政車庫駐車場"]
[47,null,null,null,null,8,null,"",null,"貸方","SU-0Z0100","(株)日新",415100,"未払費用",988416,null,20220731,"T","日新　7月　寛政車庫駐車場"]
[47,null,null,null,null,null,null,null,null,null,null,null,null,"借方合計",{"$f":"SUMIF(J268:J275,\"借方\",O268:O275)","v":1234237}]
[47,null,null,null,null,null,null,null,null,null,null,null,null,"貸方合計",{"$f":"SUMIF(J268:J275,\"貸方\",O268:O275)","v":1234237}]
[48,20220630,"No.111","ブリヂストンタイヤ",null,1,"SU-0200","運送","Nタイヤ費","借方",null,"",351000,"売上原価",1126840,"AA",null,null,"ブリヂストンタイヤ　６月　月次使用料"]
[48,null,null,null,null,2,null,"",null,"貸方","SU-000045","ブリヂストンタイヤソリューションジャパン(株)",415100,"未払費用",1126840,null,20220731,"T","ブリヂストンタイヤ　６月　月次使用料"]
[48,null,null,"東亜部品",null,3,"SU-0200","運送","部分品費","借方",null,"",351000,"売上原価",861333,"AA",null,null,"東亜部品商会　６月　整備部品代　"]
[48,null,null,null,null,4,null,"",null,"貸方","SU-000034","(株)東亜部品商会",415100,"未払費用",861333,null,20220731,"T","東亜部品商会　６月　整備部品代　"]
[48,null,null,"石綿商店",null,5,"SU-0200","運送",null,"借方",null,"",352900,"原価-雑費",22000,"AA",null,null,"石綿商店　６月　廃棄物処理費"]
[48,null,null,null,null,6,null,"",null,"貸方","SU-000012","(株)石綿商店",415100,"未払費用",22000,null,20220731,"T","石綿商店　６月　廃棄物処理費"]
[48,null,null,"NPシステム",null,7,"SU-0200","運送",null,"借方",null,"",352100,"原価-通信費",187605,"AA",null,null,"NPシステム　６月　通信費、デジタコ"]
[48,null,null,null,null,8,null,"",null,"貸方","SU-000003","(株)NPシステム開発",415100,"未払費用",187605,null,20220731,"T","NPシステム　６月　通信費、デジタコ"]
[48,null,null,"鶴見油化工業",null,9,"SU-0200","運送",null,"借方",null,"",352900,"原価-雑費",24200,"AA",null,null,"鶴見油化工業　６月　廃溶剤"]
[48,null,null,null,null,10,null,"",null,"貸方","SU-000033","鶴見油化工業(株)",415100,"未払費用",24200,null,20220731,"T","鶴見油化工業　６月　廃溶剤"]
[48,null,null,"VISH",null,11,"SU-0200","運送",null,"借方",null,"",352100,"原価-通信費",61600,"AA",null,null,"VISH　６月　トレーラー無線使用料"]
[48,null,null,null,null,12,null,"",null,"貸方","SU-000006","VISH(株)",415100,"未払費用",61600,null,20220731,"T","VISH　６月　トレーラー無線使用料"]
[48,null,null,"宮本商事",null,13,"SU-0200","運送",null,"借方",null,"",352900,"原価-雑費",114400,"AA",null,null,"宮本商事　６月　特車申請代行費"]
[48,null,null,null,null,14,null,"",null,"貸方","SU-000080","（有）宮本商事",415100,"未払費用",114400,null,20220731,"T","宮本商事　６月　特車申請代行費"]
[48,null,null,"南関東日野自動車",null,15,"SU-0200","運送",null,"借方",null,"",351400,"原価-修繕費",8096,"AA",null,null,"南関東日野自動車　#182 エンジン不良修繕"]
[48,null,null,null,null,16,null,"",null,"貸方","SU-000100","諸費",415100,"未払費用",8096,null,20220731,"T","南関東日野自動車　#182 エンジン不良修繕"]
[48,null,null,"モリカワ商事",null,17,"SU-0200","運送","軽油費","借方",null,"",148100,"仮払金",6398480,"AA",null,null,"モリカワ商事　６月　軽油費"]
[48,null,null,null,null,18,"SU-0200","運送","軽油税","借方",null,"",148100,"仮払金",2311200,"A0",null,null,"モリカワ商事　６月　軽油税"]
[48,null,null,null,null,19,"SU-0200","運送","油脂費","借方",null,"",148100,"仮払金",615329,"AA",null,null,"モリカワ商事　６月　アドブルー"]
[48,null,null,null,null,20,null,"",null,"貸方","SU-000063","モリカワ商事（株）",415100,"未払費用",9325009,null,20220731,"T","モリカワ商事　６月　"]
[48,null,null,null,null,null,null,null,null,null,null,null,null,"借方合計",{"$f":"SUMIF(J278:J297,\"借方\",O278:O297)","v":11731083}]
[48,null,null,null,null,null,null,null,null,null,null,null,null,"貸方合計",{"$f":"SUMIF(J278:J297,\"貸方\",O278:O297)","v":11731083}]
[49,20220630,"No.112","変動給",null,1,"SU-0200","運送",null,"借方",null,"",351210,"原価-給与",151698,null,null,null,"給与　６月変動給（7/25支払）業務課"]
[49,null,null,null,null,2,"SU-0100","本社",null,"借方",null,"",824200,"管理-職員給与",5412,null,null,null,"給与　６月変動給（7/25支払）管理部"]
[49,null,null,null,null,3,"SU-0200","運送",null,"借方",null,"",351210,"原価-給与",4686055,null,null,null,"給与　６月変動給（7/25支払）運転員"]
[49,null,null,null,null,4,"SU-0400","川崎営業所",null,"借方",null,"",351210,"原価-給与",505132,null,null,null,"給与　６月変動給（7/25支払）川崎"]
[49,null,null,null,null,5,null,"",null,"貸方",null,"",415100,"未払費用",5348297,null,20220725,"T","給与　６月変動給（7/25支払）"]
[49,null,null,null,null,null,null,null,null,null,null,null,null,"借方合計",{"$f":"SUMIF(J300:J304,\"借方\",O300:O304)","v":5348297}]
[49,null,null,null,null,null,null,null,null,null,null,null,null,"貸方合計",{"$f":"SUMIF(J300:J304,\"貸方\",O300:O304)","v":5348297}]
[50,20220630,"No.113","広栄運輸",null,1,"SU-0300","庸車",null,"借方",null,"",351051,"原価-陸運(傭車)",16876068,"AA",null,null,"広栄運輸　６月　傭車料（課税）"]
[50,null,null,null,null,2,"SU-0300","庸車",null,"借方",null,"",351051,"原価-陸運(傭車)",1828675,"A9",null,null,"広栄運輸　６月　傭車料（免税）"]
[50,null,null,null,null,3,null,"",null,"貸方","SU-009973","広栄運輸(株)",412100,"買掛金",18704743,null,20220731,"T","広栄運輸　６月　傭車料"]
[50,null,null,null,null,null,null,null,null,null,null,null,null,"借方合計",{"$f":"SUMIF(J307:J309,\"借方\",O307:O309)","v":18704743}]
[50,null,null,null,null,null,null,null,null,null,null,null,null,"貸方合計",{"$f":"SUMIF(J307:J309,\"貸方\",O307:O309)","v":18704743}]
[51,20220630,"No.114","通勤費",null,1,"SU-0100","本社",null,"借方",null,"",824320,"管理-通勤費",22320,"AA",null,null,"給与　６月通勤費（7/25支払）管理部"]
[51,null,null,null,null,2,null,"",null,"貸方",null,"",415100,"未払費用",22320,null,20220725,"T","給与　６月通勤費（7/25支払）管理部"]
[51,null,null,null,null,null,null,null,null,null,null,null,null,"借方合計",{"$f":"SUMIF(J312:J313,\"借方\",O312:O313)","v":22320}]
[51,null,null,null,null,null,null,null,null,null,null,null,null,"貸方合計",{"$f":"SUMIF(J312:J313,\"貸方\",O312:O313)","v":22320}]
[52,20220630,"No.115","退職給付引当金",null,1,"SU-0200","運送",null,"借方",null,"",351240,"原価-退職給付費用",34200,null,null,null,"退職給付引当金　６月　業務課"]
[52,null,null,null,null,2,"SU-0400","川崎営業所",null,"借方",null,"",351240,"原価-退職給付費用",17700,null,null,null,"退職給付引当金　６月　川崎"]
[52,null,null,null,null,3,"SU-0500","修理",null,"借方",null,"",351240,"原価-退職給付費用",1300,null,null,null,"退職給付引当金　６月　整備"]
[52,null,null,null,null,4,"SU-0200","運送",null,"借方",null,"",351240,"原価-退職給付費用",119400,null,null,null,"退職給付引当金　６月　運転員"]
[52,null,null,null,null,5,null,"",null,"貸方",null,"",572100,"退職給付引当金",172600,null,null,null,"退職給付引当金　６月　"]
[52,null,null,null,null,null,null,null,null,null,null,null,null,"借方合計",{"$f":"SUMIF(J316:J320,\"借方\",O316:O320)","v":172600}]
[52,null,null,null,null,null,null,null,null,null,null,null,null,"貸方合計",{"$f":"SUMIF(J316:J320,\"貸方\",O316:O320)","v":172600}]
[53,20220630,"No.116","労働保険料",null,1,"SU-0100","本社",null,"借方",null,"",824900,"管理-法定福利費",5300,null,null,null,"労働保険料　会社負担　６月　役員"]
[53,null,null,null,null,2,"SU-0100","本社",null,"借方",null,"",824900,"管理-法定福利費",3500,null,null,null,"労働保険料　会社負担　６月　管理部"]
[53,null,null,null,null,3,"SU-0200","運送",null,"借方",null,"",351250,"原価-法定福利費",40800,null,null,null,"労働保険料　会社負担　６月　業務課"]
[53,null,null,null,null,4,"SU-0400","川崎営業所",null,"借方",null,"",351250,"原価-法定福利費",53500,null,null,null,"労働保険料　会社負担　６月　川崎"]
[53,null,null,null,null,5,"SU-0500","修理",null,"借方",null,"",351250,"原価-法定福利費",7600,null,null,null,"労働保険料　会社負担　６月　整備"]
[53,null,null,null,null,6,"SU-0200","運送",null,"借方",null,"",351250,"原価-法定福利費",280900,null,null,null,"労働保険料　会社負担　６月　運転員"]
[53,null,null,null,null,7,null,"",null,"貸方",null,"",415100,"未払費用",391600,null,null,null,"労働保険料　会社負担　６月　"]
[53,null,null,null,null,null,null,null,null,null,null,null,null,"借方合計",{"$f":"SUMIF(J323:J329,\"借方\",O323:O329)","v":391600}]
[53,null,null,null,null,null,null,null,null,null,null,null,null,"貸方合計",{"$f":"SUMIF(J323:J329,\"貸方\",O323:O329)","v":391600}]
[54,20220630,"No.117","さつき工業協同組合",null,1,null,"",null,"借方","SU-000025","さつき工業協同組合",415100,"未払費用",5800000,null,20220801,"D","さつき工業協同組合　ETC概算戻し"]
[54,null,null,null,null,2,"SU-0200","運送",null,"貸方",null,"",351900,"原価-旅費交通費",5800000,"UA",null,null,"さつき工業協同組合　ETC概算戻し"]
[54,null,null,null,null,null,null,null,null,null,null,null,null,"借方合計",{"$f":"SUMIF(J332:J333,\"借方\",O332:O333)","v":5800000}]
[54,null,null,null,null,null,null,null,null,null,null,null,null,"貸方合計",{"$f":"SUMIF(J332:J333,\"貸方\",O332:O333)","v":5800000}]
[55,20220630,"No.118","さつき工業協同組合",null,1,"SU-0200","運送",null,"借方",null,"",351900,"原価-旅費交通費",5800000,"AA",null,null,"さつき工業協同組合　ETC使用料　概算計上"]
[55,null,null,null,null,2,null,"",null,"貸方","SU-000025","さつき工業協同組合",415100,"未払費用",5800000,null,20220801,"D","さつき工業協同組合　ETC使用料　概算計上"]
[55,null,null,null,null,null,null,null,null,null,null,null,null,"借方合計",{"$f":"SUMIF(J336:J337,\"借方\",O336:O337)","v":5800000}]
[55,null,null,null,null,null,null,null,null,null,null,null,null,"貸方合計",{"$f":"SUMIF(J336:J337,\"貸方\",O336:O337)","v":5800000}]
[56,20220630,"No.119","賞与引当金",null,1,"SU-0100","本社",null,"借方",null,"",351222,"原価-賞与引当金繰入",387906,null,null,null,"冬季賞与引当金　６月　業務課"]
[56,null,null,null,null,2,"SU-0200","運送",null,"借方",null,"",351222,"原価-賞与引当金繰入",2396028,null,null,null,"冬季賞与引当金　６月　運転員"]
[56,null,null,null,null,3,"SU-0400","川崎営業所",null,"借方",null,"",351222,"原価-賞与引当金繰入",466154,null,null,null,"冬季賞与引当金　６月　川崎"]
[56,null,null,null,null,4,"SU-0500","修理",null,"借方",null,"",351222,"原価-賞与引当金繰入",79912,null,null,null,"冬季賞与引当金　６月　整備"]
[56,null,null,null,null,5,null,"",null,"貸方",null,"",418100,"賞与引当金",3330000,null,null,null,"冬季賞与引当金　６月　業務課"]
[56,null,null,null,null,null,null,null,null,null,null,null,null,"借方合計",{"$f":"SUMIF(J340:J344,\"借方\",O340:O344)","v":3330000}]
[56,null,null,null,null,null,null,null,null,null,null,null,null,"貸方合計",{"$f":"SUMIF(J340:J344,\"貸方\",O340:O344)","v":3330000}]
[57,20220630,"No.120","広栄運輸",null,1,null,"",null,"借方","SU-009973","広栄運輸(株)",145100,"未収入金",383201,null,20220731,"T","広栄運輸　出向者　給与６月分"]
[57,null,null,null,null,2,"SU-0200","運送",null,"貸方",null,"",351210,"原価-給与",325000,null,null,null,"広栄運輸　出向者　給与６月分"]
[57,null,null,null,null,3,"SU-0200","運送",null,"貸方",null,"",351250,"原価-法定福利費",21852,null,null,null,"広栄運輸　出向者　６月健康保険＋介護保険"]
[57,null,null,null,null,4,"SU-0200","運送",null,"貸方",null,"",351250,"原価-法定福利費",34236,null,null,null,"広栄運輸　出向者　６月厚生年金保険"]
[57,null,null,null,null,5,"SU-0200","運送",null,"貸方",null,"",351250,"原価-法定福利費",2113,null,null,null,"広栄運輸　出向者　６月雇用保険"]
[57,null,null,null,null,null,null,null,null,null,null,null,null,"借方合計",{"$f":"SUMIF(J347:J351,\"借方\",O347:O351)","v":383201}]
[57,null,null,null,null,null,null,null,null,null,null,null,null,"貸方合計",{"$f":"SUMIF(J347:J351,\"貸方\",O347:O351)","v":383201}]
[58,20220630,"No.121","広栄運輸",null,1,null,"",null,"借方","SU-009973","広栄運輸(株)",113100,"売掛金",486860,null,20220731,"T","広栄運輸　６月　シャーシ管理"]
[58,null,null,null,null,2,"SU-0200","運送",null,"貸方",null,"",351600,"原価-賃借料",357500,"AA",null,null,"広栄運輸　６月　シャーシ管理"]
[58,null,null,null,null,3,"SU-0200","運送",null,"貸方",null,"",352900,"原価-雑費",59400,"AA",null,null,"広栄運輸　６月　無線使用料"]
[58,null,null,null,null,4,"SU-0200","運送",null,"貸方",null,"",352900,"原価-雑費",36960,"AA",null,null,"広栄運輸　６月　車載端末使用料"]
[58,null,null,null,null,5,"SU-0200","運送",null,"貸方",null,"",351700,"原価-保険",33000,"A0",null,null,"広栄運輸　６月　コンテナ保険料"]
[58,null,null,null,null,null,null,null,null,null,null,null,null,"借方合計",{"$f":"SUMIF(J354:J358,\"借方\",O354:O358)","v":486860}]
[58,null,null,null,null,null,null,null,null,null,null,null,null,"貸方合計",{"$f":"SUMIF(J354:J358,\"貸方\",O354:O358)","v":486860}]
[59,20220630,"No.122","日新",null,1,"SU-0200","運送",null,"借方",null,"",351600,"原価-賃借料",357500,"AA",null,null,"日新　６月　シャーシ管理"]
[59,null,null,null,null,2,"SU-0200","運送",null,"借方",null,"",352900,"原価-雑費",59400,"AA",null,null,"日新　６月　無線使用料"]
[59,null,null,null,null,3,"SU-0200","運送",null,"借方",null,"",352900,"原価-雑費",36960,"AA",null,null,"日新　６月　車載端末使用料"]
[59,null,null,null,null,4,"SU-0200","運送",null,"借方",null,"",351700,"原価-保険",33000,"A0",null,null,"日新　６月　コンテナ保険料"]
[59,null,null,null,null,5,null,"",null,"貸方","SU-0Z0100","(株)日新",148100,"仮払金",486860,null,20220731,"T","日新　６月　シャーシ管理"]
[59,null,null,null,null,null,null,null,null,null,null,null,null,"借方合計",{"$f":"SUMIF(J361:J365,\"借方\",O361:O365)","v":486860}]
[59,null,null,null,null,null,null,null,null,null,null,null,null,"貸方合計",{"$f":"SUMIF(J361:J365,\"貸方\",O361:O365)","v":486860}]
[60,20220630,"No.123","日新健保組合",null,1,"SU-0100","本社",null,"借方",null,"",824900,"管理-法定福利費",71863,null,null,null,"日新健保組合　６月　会社負担　健康保険料　役員"]
[60,null,null,null,null,2,"SU-0100","本社",null,"借方",null,"",824900,"管理-法定福利費",13442,null,null,null,"日新健保組合　６月　会社負担　健康保険料　管理部"]
[60,null,null,null,null,3,"SU-0200","運送",null,"借方",null,"",351250,"原価-法定福利費",99781,null,null,null,"日新健保組合　６月　会社負担　健康保険料　業務課"]
[60,null,null,null,null,4,"SU-0400","川崎営業所",null,"借方",null,"",351250,"原価-法定福利費",121495,null,null,null,"日新健保組合　６月　会社負担　健康保険料　川崎"]
[60,null,null,null,null,5,"SU-0500","修理",null,"借方",null,"",351250,"原価-法定福利費",17578,null,null,null,"日新健保組合　６月　会社負担　健康保険料　整備"]
[60,null,null,null,null,6,"SU-0200","運送",null,"借方",null,"",351250,"原価-法定福利費",684508,null,null,null,"日新健保組合　６月　会社負担　健康保険料　運転員"]
[60,null,null,null,null,7,"SU-0100","本社",null,"借方",null,"",824900,"管理-法定福利費",12510,null,null,null,"日新健保組合　６月　会社負担　介護保険料　役員"]
[60,null,null,null,null,8,"SU-0200","運送",null,"借方",null,"",351250,"原価-法定福利費",13950,null,null,null,"日新健保組合　６月　会社負担　介護保険料　業務課"]
[60,null,null,null,null,9,"SU-0400","川崎営業所",null,"借方",null,"",351250,"原価-法定福利費",17460,null,null,null,"日新健保組合　６月　会社負担　介護保険料　川崎"]
[60,null,null,null,null,10,"SU-0500","修理",null,"借方",null,"",351250,"原価-法定福利費",3060,null,null,null,"日新健保組合　６月　会社負担　介護保険料　整備"]
[60,null,null,null,null,11,"SU-0200","運送",null,"借方",null,"",351250,"原価-法定福利費",108360,null,null,null,"日新健保組合　６月　会社負担　介護保険料　運転員"]
[60,null,null,null,null,12,null,"",null,"貸方","SU-000041","日新健保保険組合",415100,"未払費用",1164007,null,20220731,null,"日新健保組合　６月　会社負担　健康保険料　"]
[60,null,null,null,null,null,null,null,null,null,null,null,null,"借方合計",{"$f":"SUMIF(J368:J379,\"借方\",O368:O379)","v":1164007}]
[60,null,null,null,null,null,null,null,null,null,null,null,null,"貸方合計",{"$f":"SUMIF(J368:J379,\"貸方\",O368:O379)","v":1164007}]
[61,20220630,"No.124","鶴見年金事務所",null,1,"SU-0100","本社",null,"借方",null,"",824900,"管理-法定福利費",118950,null,null,null,"鶴見年金事務所　６月　会社負担　厚生年金　役員"]
[61,null,null,null,null,2,"SU-0200","運送",null,"借方",null,"",351250,"原価-法定福利費",176595,null,null,null,"鶴見年金事務所　６月　会社負担　厚生年金　業務課"]
[61,null,null,null,null,3,"SU-0400","川崎営業所",null,"借方",null,"",351250,"原価-法定福利費",215025,null,null,null,"鶴見年金事務所　６月　会社負担　厚生年金　川崎"]
[61,null,null,null,null,4,"SU-0500","修理",null,"借方",null,"",351250,"原価-法定福利費",31110,null,null,null,"鶴見年金事務所　６月　会社負担　厚生年金　整備"]
[61,null,null,null,null,5,"SU-0200","運送",null,"借方",null,"",351250,"原価-法定福利費",1211460,null,null,null,"鶴見年金事務所　６月　会社負担　厚生年金　運転員"]
[61,null,null,null,null,6,"SU-0100","本社",null,"借方",null,"",824900,"管理-法定福利費",4680,null,null,null,"鶴見年金事務所　６月　会社負担　子育拠出　役員"]
[61,null,null,null,null,7,"SU-0200","運送",null,"借方",null,"",351250,"原価-法定福利費",6948,null,null,null,"鶴見年金事務所　６月　会社負担　子育拠出　業務課"]
[61,null,null,null,null,8,"SU-0400","川崎営業所",null,"借方",null,"",351250,"原価-法定福利費",8460,null,null,null,"鶴見年金事務所　６月　会社負担　子育拠出　川崎"]
[61,null,null,null,null,9,"SU-0500","修理",null,"借方",null,"",351250,"原価-法定福利費",1224,null,null,null,"鶴見年金事務所　６月　会社負担　子育拠出　整備"]
[61,null,null,null,null,10,"SU-0200","運送",null,"借方",null,"",351250,"原価-法定福利費",47664,null,null,null,"鶴見年金事務所　６月　会社負担　子育拠出　運転員"]
[61,null,null,null,null,11,null,"",null,"貸方","SU-000032","鶴見年金事務所",415100,"未払費用",1822116,null,20220731,"D","鶴見年金事務所　６月　会社負担　厚生年金"]
[61,null,null,null,null,null,null,null,null,null,null,null,null,"借方合計",{"$f":"SUMIF(J382:J392,\"借方\",O382:O392)","v":1822116}]
[61,null,null,null,null,null,null,null,null,null,null,null,null,"貸方合計",{"$f":"SUMIF(J382:J392,\"貸方\",O382:O392)","v":1822116}]
[62,20220630,"No.125","ANT企業年金",null,1,"SU-0100","本社",null,"借方",null,"",824800,"管理-退職給付費用",7823,null,null,null,"ANT企業年金　６月　退職金部分　役員"]
[62,null,null,null,null,2,"SU-0200","運送",null,"借方",null,"",351240,"原価-退職給付費用",36500,null,null,null,"ANT企業年金　６月　退職金部分　業務課"]
[62,null,null,null,null,3,"SU-0200","運送",null,"借方",null,"",351240,"原価-退職給付費用",178664,null,null,null,"ANT企業年金　６月　退職金部分　運転員"]
[62,null,null,null,null,4,"SU-0400","川崎営業所",null,"借方",null,"",351240,"原価-退職給付費用",6624,null,null,null,"ANT企業年金　６月　退職金部分　川崎"]
[62,null,null,null,null,5,"SU-0500","修理",null,"借方",null,"",351240,"原価-退職給付費用",1325,null,null,null,"ANT企業年金　６月　退職金部分　整備"]
[62,null,null,null,null,6,null,"",null,"貸方","SU-000001","ANT企業年金基金",415100,"未払費用",230936,null,20220801,"D","ANT企業年金　６月　退職金部分"]
[62,null,null,null,null,null,null,null,null,null,null,null,null,"借方合計",{"$f":"SUMIF(J395:J400,\"借方\",O395:O400)","v":230936}]
[62,null,null,null,null,null,null,null,null,null,null,null,null,"貸方合計",{"$f":"SUMIF(J395:J400,\"貸方\",O395:O400)","v":230936}]
[63,20220630,"No.126","ANT企業年金",null,1,"SU-0100","本社",null,"借方",null,"",825000,"管理-福利厚生費",10720,null,null,null,"ANT企業年金　６月　年金部分　役員"]
[63,null,null,null,null,2,"SU-0200","運送",null,"借方",null,"",351260,"原価-福利厚生費",33020,null,null,null,"ANT企業年金　６月　年金部分　業務課"]
[63,null,null,null,null,3,"SU-0200","運送",null,"借方",null,"",351260,"原価-福利厚生費",217560,null,null,null,"ANT企業年金　６月　年金部分　運転員"]
[63,null,null,null,null,4,"SU-0400","川崎営業所",null,"借方",null,"",351260,"原価-福利厚生費",37580,null,null,null,"ANT企業年金　６月　年金部分　川崎"]
[63,null,null,null,null,5,"SU-0500","修理",null,"借方",null,"",351260,"原価-福利厚生費",5960,null,null,null,"ANT企業年金　６月　年金部分　整備"]
[63,null,null,null,null,6,null,"",null,"貸方","SU-000001","ANT企業年金基金",415100,"未払費用",304840,null,20220801,"D","ANT企業年金　６月　年金部分　"]
[63,null,null,null,null,null,null,null,null,null,null,null,null,"借方合計",{"$f":"SUMIF(J403:J408,\"借方\",O403:O408)","v":304840}]
[63,null,null,null,null,null,null,null,null,null,null,null,null,"貸方合計",{"$f":"SUMIF(J403:J408,\"貸方\",O403:O408)","v":304840}]
[64,20220630,"No.127","神奈川菱光コンクリート",null,1,null,"",null,"借方","SU-000074","神奈川菱光コンクリート（株）",113100,"売掛金",149600,null,20220731,null,"神奈川菱光コンクリート　６月　塩浜車庫賃貸料"]
[64,null,null,null,null,2,"SU-0200","運送","運送雑収入","貸方",null,"",865710,"外収その他",149600,"UA",null,null,"神奈川菱光コンクリート　６月　塩浜車庫賃貸料"]
[64,null,null,null,null,null,null,null,null,null,null,null,null,"借方合計",{"$f":"SUMIF(J411:J412,\"借方\",O411:O412)","v":149600}]
[64,null,null,null,null,null,null,null,null,null,null,null,null,"貸方合計",{"$f":"SUMIF(J411:J412,\"貸方\",O411:O412)","v":149600}]
[65,20220630,"No.128","UDトラックス",null,1,"SU-0500","修理","部分品費","借方",null,"",351000,"売上原価",93060,"AA",null,null,"UDトラックス 部分品費"]
[65,null,null,null,null,2,null,"",null,"貸方","SU-000093","UDトラックス株式会社",415100,"未払費用",93060,null,20220715,"T","UDトラックス 部分品費"]
[65,null,null,null,null,null,null,null,null,null,null,null,null,"借方合計",{"$f":"SUMIF(J415:J416,\"借方\",O415:O416)","v":93060}]
[65,null,null,null,null,null,null,null,null,null,null,null,null,"貸方合計",{"$f":"SUMIF(J415:J416,\"貸方\",O415:O416)","v":93060}]
[66,20220630,"No.129","朝日ネット",null,1,"SU-0100","本社",null,"借方",null,"",826400,"管理-通信費",3630,"AA",null,null,"朝日ネット　６月　光　固定IP"]
[66,null,null,null,null,2,null,"",null,"貸方","SU-000009","(株)朝日ネット",415100,"未払費用",3630,null,20220727,"D","朝日ネット　６月　光　固定IP"]
[66,null,null,null,null,null,null,null,null,null,null,null,null,"借方合計",{"$f":"SUMIF(J419:J420,\"借方\",O419:O420)","v":3630}]
[66,null,null,null,null,null,null,null,null,null,null,null,null,"貸方合計",{"$f":"SUMIF(J419:J420,\"貸方\",O419:O420)","v":3630}]
[67,20220630,"No.130","アサヒ飲料",null,1,null,"",null,"借方","SU-000055","アサヒ飲料",145100,"未収入金",9157,null,20220720,"D","アサヒ飲料　６月　自販機手数料"]
[67,null,null,null,null,2,"SU-0100","本社",null,"貸方",null,"",865710,"外収その他",9157,"UA",null,null,"アサヒ飲料　６月　自販機手数料"]
[67,null,null,null,null,null,null,null,null,null,null,null,null,"借方合計",{"$f":"SUMIF(J423:J424,\"借方\",O423:O424)","v":9157}]
[67,null,null,null,null,null,null,null,null,null,null,null,null,"貸方合計",{"$f":"SUMIF(J423:J424,\"貸方\",O423:O424)","v":9157}]
[68,20220630,"No.131","国際コンテナ輸送",null,1,"SU-0200","運送",null,"借方",null,"",351700,"原価-保険",17400,"A0",null,null,"国際コンテナ輸送　６月　貨物損害賠償保険料"]
[68,null,null,null,null,2,null,"",null,"貸方","SU-000024","国際コンテナ運輸株式会社",415100,"未払費用",17400,null,20220731,"D","国際コンテナ輸送　６月　貨物損害賠償保険料"]
[68,null,null,null,null,null,null,null,null,null,null,null,null,"借方合計",{"$f":"SUMIF(J427:J428,\"借方\",O427:O428)","v":17400}]
[68,null,null,null,null,null,null,null,null,null,null,null,null,"貸方合計",{"$f":"SUMIF(J427:J428,\"貸方\",O427:O428)","v":17400}]

{"sheet":"DEN","index":1,"n_rows":197,"n_cols":43,"rows_kept":197,"cut":false,"hidden":false,"merged":[]}
[null,null,null,null,null,null,null,null,null,null,null,null,null,null,null,null,null,"使い方"]
[null,null,null,null,null,null,null,null,"合計金額一致判定",{"$f":"IF(SUM(N5:N300)/2=SUM(SUMIFS(OriginalData[仕入集計金額],OriginalData[仕入先コード],\"0*\"),SUMIFS(OriginalData[仕入消費税金額],OriginalData[仕入先コード],\"0*\")),\"OK\",\"NG\")","v":"OK"},null,"X",null,"2023-06-01",null,null,null,"➀「データ取込」シートで「カクテルデータ取込」を押し、ファイルを選択。"]
[null,null,null,null,null,null,null,null,null,null,null,null,null,null,null,null,null,"➁「DEN」シートで当年月度を入力後、「BI作成」を押す。"]
["取引先","伝票日付","会社","転記日付","伝票\nタイプ","通貨\nコード","換算\nレート","参照伝票番号","ヘッダテキスト","税自動\n計算","転記\nキー","勘定コード","特殊\nGL","金額","国内通貨額","税\nコード","事業\n領域","原価センタ","利益センタ","ソートキー","明細テキスト","起算日","期日","振出日","支払\n方法","支払\n保留","取引先銀行","取引銀行","中央銀行ＣＤ","数量","数量単位","指図書","ＷＢＳ","得意先コード","品目コード","販売組織","流通チャネル","製品部門","品目グループ","営業所","営業グループ","需要家","支払条件"]
[null,"20230707","KN",20230630,"SA","JPY",null,"23-06-001","三井物産(油脂加工)","X",40,351000,null,1811352,null,null,"KN","KN-0300",null,"当月仕入高","三井物産㈱油脂・加工開発営業室　2023/06月分",null,null,null,null,null,null,null,null,null,null,null,null,null,null,null,null,null,null,null,null,null,{"$f":"IFERROR(VLOOKUP(L5,Suppliers[[取引先コード\n（SAP）]:[支払条件]],6,0),\"\")","v":""}]
[null,null,null,null,null,null,null,null,null,null,40,148100,null,144909,null,null,"KN",null,null,"仮払消費税","三井物産㈱油脂・加工開発営業室　2023/06月分",null,null,null,null,null,null,null,null,null,null,null,null,null,null,null,null,null,null,null,null,null,{"$f":"IFERROR(VLOOKUP(L6,Suppliers[[取引先コード\n（SAP）]:[支払条件]],6,0),\"\")","v":""}]
[null,null,null,null,null,null,null,null,null,null,31,"KN-000017",null,1956261,null,null,"KN",null,null,"当月仕入高","三井物産㈱油脂・加工開発営業室　2023/06月分",null,20230915,null,"T",null,null,null,null,null,null,null,null,null,null,null,null,null,null,null,null,null,{"$f":"IFERROR(VLOOKUP(L7,Suppliers[[取引先コード\n（SAP）]:[支払条件]],6,0),\"\")","v":"月末〆７５日後払"}]
[null,"20230707","KN",20230630,"SA","JPY",null,"23-06-002","隅田商事","X",40,351000,null,89902,null,null,"KN","KN-0300",null,"当月仕入高","隅田商事㈱　2023/06月分",null,null,null,null,null,null,null,null,null,null,null,null,null,null,null,null,null,null,null,null,null,{"$f":"IFERROR(VLOOKUP(L8,Suppliers[[取引先コード\n（SAP）]:[支払条件]],6,0),\"\")","v":""}]
[null,null,null,null,null,null,null,null,null,null,40,148100,null,7252,null,null,"KN",null,null,"仮払消費税","隅田商事㈱　2023/06月分",null,null,null,null,null,null,null,null,null,null,null,null,null,null,null,null,null,null,null,null,null,{"$f":"IFERROR(VLOOKUP(L9,Suppliers[[取引先コード\n（SAP）]:[支払条件]],6,0),\"\")","v":""}]
[null,null,null,null,null,null,null,null,null,null,31,"KN-000081",null,97154,null,null,"KN",null,null,"当月仕入高","隅田商事㈱　2023/06月分",null,20230731,null,"T",null,null,null,null,null,null,null,null,null,null,null,null,null,null,null,null,null,{"$f":"IFERROR(VLOOKUP(L10,Suppliers[[取引先コード\n（SAP）]:[支払条件]],6,0),\"\")","v":"月末〆３０日後払"}]
[null,"20230707","KN",20230630,"SA","JPY",null,"23-06-003","三菱商事(はくばく)","X",40,351000,null,8554275,null,null,"KN","KN-0300",null,"当月仕入高","三菱商事㈱ （はくばく・粉）　2023/06月分",null,null,null,null,null,null,null,null,null,null,null,null,null,null,null,null,null,null,null,null,null,{"$f":"IFERROR(VLOOKUP(L11,Suppliers[[取引先コード\n（SAP）]:[支払条件]],6,0),\"\")","v":""}]
[null,null,null,null,null,null,null,null,null,null,40,148100,null,684342,null,null,"KN",null,null,"仮払消費税","三菱商事㈱ （はくばく・粉）　2023/06月分",null,null,null,null,null,null,null,null,null,null,null,null,null,null,null,null,null,null,null,null,null,{"$f":"IFERROR(VLOOKUP(L12,Suppliers[[取引先コード\n（SAP）]:[支払条件]],6,0),\"\")","v":""}]
[null,null,null,null,null,null,null,null,null,null,31,"KN-000123",null,9238617,null,null,"KN",null,null,"当月仕入高","三菱商事㈱ （はくばく・粉）　2023/06月分",null,20230731,null,"T",null,null,null,null,null,null,null,null,null,null,null,null,null,null,null,null,null,{"$f":"IFERROR(VLOOKUP(L13,Suppliers[[取引先コード\n（SAP）]:[支払条件]],6,0),\"\")","v":"月末〆３０日後払"}]
[null,"20230707","KN",20230630,"SA","JPY",null,"23-06-004","三菱商事(鳥越製粉)","X",40,351000,null,9892,null,null,"KN","KN-0300",null,"当月仕入高","三菱商事㈱（鳥越製粉）　2023/06月分",null,null,null,null,null,null,null,null,null,null,null,null,null,null,null,null,null,null,null,null,null,{"$f":"IFERROR(VLOOKUP(L14,Suppliers[[取引先コード\n（SAP）]:[支払条件]],6,0),\"\")","v":""}]
[null,null,null,null,null,null,null,null,null,null,40,148100,null,791,null,null,"KN",null,null,"仮払消費税","三菱商事㈱（鳥越製粉）　2023/06月分",null,null,null,null,null,null,null,null,null,null,null,null,null,null,null,null,null,null,null,null,null,{"$f":"IFERROR(VLOOKUP(L15,Suppliers[[取引先コード\n（SAP）]:[支払条件]],6,0),\"\")","v":""}]
[null,null,null,null,null,null,null,null,null,null,31,"KN-000154",null,10683,null,null,"KN",null,null,"当月仕入高","三菱商事㈱（鳥越製粉）　2023/06月分",null,20230731,null,"T",null,null,null,null,null,null,null,null,null,null,null,null,null,null,null,null,null,{"$f":"IFERROR(VLOOKUP(L16,Suppliers[[取引先コード\n（SAP）]:[支払条件]],6,0),\"\")","v":"月末〆３０日後払"}]
[null,"20230707","KN",20230630,"SA","JPY",null,"23-06-005","ニップン商事","X",40,351000,null,6934586,null,null,"KN","KN-0300",null,"当月仕入高","㈱ニップン商事コ－ポレ－ション　2023/06月分",null,null,null,null,null,null,null,null,null,null,null,null,null,null,null,null,null,null,null,null,null,{"$f":"IFERROR(VLOOKUP(L17,Suppliers[[取引先コード\n（SAP）]:[支払条件]],6,0),\"\")","v":""}]
[null,null,null,null,null,null,null,null,null,null,40,148100,null,554766,null,null,"KN",null,null,"仮払消費税","㈱ニップン商事コ－ポレ－ション　2023/06月分",null,null,null,null,null,null,null,null,null,null,null,null,null,null,null,null,null,null,null,null,null,{"$f":"IFERROR(VLOOKUP(L18,Suppliers[[取引先コード\n（SAP）]:[支払条件]],6,0),\"\")","v":""}]
[null,null,null,null,null,null,null,null,null,null,31,"KN-000215",null,7489352,null,null,"KN",null,null,"当月仕入高","㈱ニップン商事コ－ポレ－ション　2023/06月分",null,20230731,null,"T",null,null,null,null,null,null,null,null,null,null,null,null,null,null,null,null,null,{"$f":"IFERROR(VLOOKUP(L19,Suppliers[[取引先コード\n（SAP）]:[支払条件]],6,0),\"\")","v":"月末〆３０日後払"}]
[null,"20230707","KN",20230630,"SA","JPY",null,"23-06-006","三菱商事ﾗｲﾌｻｲｴﾝｽ","X",40,351000,null,134170,null,null,"KN","KN-0300",null,"当月仕入高","三菱商事ﾗｲﾌｻｲｴﾝｽ㈱　2023/06月分",null,null,null,null,null,null,null,null,null,null,null,null,null,null,null,null,null,null,null,null,null,{"$f":"IFERROR(VLOOKUP(L20,Suppliers[[取引先コード\n（SAP）]:[支払条件]],6,0),\"\")","v":""}]
[null,null,null,null,null,null,null,null,null,null,40,148100,null,10734,null,null,"KN",null,null,"仮払消費税","三菱商事ﾗｲﾌｻｲｴﾝｽ㈱　2023/06月分",null,null,null,null,null,null,null,null,null,null,null,null,null,null,null,null,null,null,null,null,null,{"$f":"IFERROR(VLOOKUP(L21,Suppliers[[取引先コード\n（SAP）]:[支払条件]],6,0),\"\")","v":""}]
[null,null,null,null,null,null,null,null,null,null,31,"KN-000253",null,144904,null,null,"KN",null,null,"当月仕入高","三菱商事ﾗｲﾌｻｲｴﾝｽ㈱　2023/06月分",null,20230831,null,"T",null,null,null,null,null,null,null,null,null,null,null,null,null,null,null,null,null,{"$f":"IFERROR(VLOOKUP(L22,Suppliers[[取引先コード\n（SAP）]:[支払条件]],6,0),\"\")","v":"月末〆６０日後払"}]
[null,"20230707","KN",20230630,"SA","JPY",null,"23-06-007","長谷川商店","X",40,351000,null,4770,null,null,"KN","KN-0300",null,"当月仕入高","㈱長谷川商店　2023/06月分",null,null,null,null,null,null,null,null,null,null,null,null,null,null,null,null,null,null,null,null,null,{"$f":"IFERROR(VLOOKUP(L23,Suppliers[[取引先コード\n（SAP）]:[支払条件]],6,0),\"\")","v":""}]
[null,null,null,null,null,null,null,null,null,null,40,148100,null,382,null,null,"KN",null,null,"仮払消費税","㈱長谷川商店　2023/06月分",null,null,null,null,null,null,null,null,null,null,null,null,null,null,null,null,null,null,null,null,null,{"$f":"IFERROR(VLOOKUP(L24,Suppliers[[取引先コード\n（SAP）]:[支払条件]],6,0),\"\")","v":""}]
[null,null,null,null,null,null,null,null,null,null,31,"KN-001111",null,5152,null,null,"KN",null,null,"当月仕入高","㈱長谷川商店　2023/06月分",null,20230731,null,"T",null,null,null,null,null,null,null,null,null,null,null,null,null,null,null,null,null,{"$f":"IFERROR(VLOOKUP(L25,Suppliers[[取引先コード\n（SAP）]:[支払条件]],6,0),\"\")","v":"月末〆３０日後払"}]
[null,"20230707","KN",20230630,"SA","JPY",null,"23-06-008","コ－ビオンジャパン","X",40,351000,null,69000,null,null,"KN","KN-0300",null,"当月仕入高","コ－ビオンジャパン㈱　2023/06月分",null,null,null,null,null,null,null,null,null,null,null,null,null,null,null,null,null,null,null,null,null,{"$f":"IFERROR(VLOOKUP(L26,Suppliers[[取引先コード\n（SAP）]:[支払条件]],6,0),\"\")","v":""}]
[null,null,null,null,null,null,null,null,null,null,40,148100,null,5520,null,null,"KN",null,null,"仮払消費税","コ－ビオンジャパン㈱　2023/06月分",null,null,null,null,null,null,null,null,null,null,null,null,null,null,null,null,null,null,null,null,null,{"$f":"IFERROR(VLOOKUP(L27,Suppliers[[取引先コード\n（SAP）]:[支払条件]],6,0),\"\")","v":""}]
[null,null,null,null,null,null,null,null,null,null,31,"KN-001131",null,74520,null,null,"KN",null,null,"当月仕入高","コ－ビオンジャパン㈱　2023/06月分",null,20230831,null,"T",null,null,null,null,null,null,null,null,null,null,null,null,null,null,null,null,null,{"$f":"IFERROR(VLOOKUP(L28,Suppliers[[取引先コード\n（SAP）]:[支払条件]],6,0),\"\")","v":"月末〆６０日後払"}]
[null,"20230707","KN",20230630,"SA","JPY",null,"23-06-009","理研ビタミン","X",40,351000,null,343600,null,null,"KN","KN-0300",null,"当月仕入高","理研ビタミン㈱　2023/06月分",null,null,null,null,null,null,null,null,null,null,null,null,null,null,null,null,null,null,null,null,null,{"$f":"IFERROR(VLOOKUP(L29,Suppliers[[取引先コード\n（SAP）]:[支払条件]],6,0),\"\")","v":""}]
[null,null,null,null,null,null,null,null,null,null,40,148100,null,27488,null,null,"KN",null,null,"仮払消費税","理研ビタミン㈱　2023/06月分",null,null,null,null,null,null,null,null,null,null,null,null,null,null,null,null,null,null,null,null,null,{"$f":"IFERROR(VLOOKUP(L30,Suppliers[[取引先コード\n（SAP）]:[支払条件]],6,0),\"\")","v":""}]
[null,null,null,null,null,null,null,null,null,null,31,"KN-001171",null,371088,null,null,"KN",null,null,"当月仕入高","理研ビタミン㈱　2023/06月分",null,20230831,null,"T",null,null,null,null,null,null,null,null,null,null,null,null,null,null,null,null,null,{"$f":"IFERROR(VLOOKUP(L31,Suppliers[[取引先コード\n（SAP）]:[支払条件]],6,0),\"\")","v":"月末〆６０日後払"}]
[null,"20230707","KN",20230630,"SA","JPY",null,"23-06-010","三井物産(オ－マイ)","X",40,351000,null,43790,null,null,"KN","KN-0300",null,"当月仕入高","三井物産㈱　オ－マイ製品　2023/06月分",null,null,null,null,null,null,null,null,null,null,null,null,null,null,null,null,null,null,null,null,null,{"$f":"IFERROR(VLOOKUP(L32,Suppliers[[取引先コード\n（SAP）]:[支払条件]],6,0),\"\")","v":""}]
[null,null,null,null,null,null,null,null,null,null,40,148100,null,3503,null,null,"KN",null,null,"仮払消費税","三井物産㈱　オ－マイ製品　2023/06月分",null,null,null,null,null,null,null,null,null,null,null,null,null,null,null,null,null,null,null,null,null,{"$f":"IFERROR(VLOOKUP(L33,Suppliers[[取引先コード\n（SAP）]:[支払条件]],6,0),\"\")","v":""}]
[null,null,null,null,null,null,null,null,null,null,31,"KN-001355",null,47293,null,null,"KN",null,null,"当月仕入高","三井物産㈱　オ－マイ製品　2023/06月分",null,20230831,null,"T",null,null,null,null,null,null,null,null,null,null,null,null,null,null,null,null,null,{"$f":"IFERROR(VLOOKUP(L34,Suppliers[[取引先コード\n（SAP）]:[支払条件]],6,0),\"\")","v":"月末〆６０日後払"}]
[null,"20230707","KN",20230630,"SA","JPY",null,"23-06-011","はくばく","X",40,351000,null,102821,null,null,"KN","KN-0300",null,"当月仕入高","㈱はくばく　2023/06月分",null,null,null,null,null,null,null,null,null,null,null,null,null,null,null,null,null,null,null,null,null,{"$f":"IFERROR(VLOOKUP(L35,Suppliers[[取引先コード\n（SAP）]:[支払条件]],6,0),\"\")","v":""}]
[null,null,null,null,null,null,null,null,null,null,40,148100,null,8274,null,null,"KN",null,null,"仮払消費税","㈱はくばく　2023/06月分",null,null,null,null,null,null,null,null,null,null,null,null,null,null,null,null,null,null,null,null,null,{"$f":"IFERROR(VLOOKUP(L36,Suppliers[[取引先コード\n（SAP）]:[支払条件]],6,0),\"\")","v":""}]
[null,null,null,null,null,null,null,null,null,null,31,"KN-001430",null,111095,null,null,"KN",null,null,"当月仕入高","㈱はくばく　2023/06月分",null,20230815,null,"T",null,null,null,null,null,null,null,null,null,null,null,null,null,null,null,null,null,{"$f":"IFERROR(VLOOKUP(L37,Suppliers[[取引先コード\n（SAP）]:[支払条件]],6,0),\"\")","v":"月末〆４５日後払"}]
[null,"20230707","KN",20230630,"SA","JPY",null,"23-06-012","川光商事","X",40,351000,null,167377,null,null,"KN","KN-0300",null,"当月仕入高","川光商事㈱　2023/06月分",null,null,null,null,null,null,null,null,null,null,null,null,null,null,null,null,null,null,null,null,null,{"$f":"IFERROR(VLOOKUP(L38,Suppliers[[取引先コード\n（SAP）]:[支払条件]],6,0),\"\")","v":""}]
[null,null,null,null,null,null,null,null,null,null,40,148100,null,13406,null,null,"KN",null,null,"仮払消費税","川光商事㈱　2023/06月分",null,null,null,null,null,null,null,null,null,null,null,null,null,null,null,null,null,null,null,null,null,{"$f":"IFERROR(VLOOKUP(L39,Suppliers[[取引先コード\n（SAP）]:[支払条件]],6,0),\"\")","v":""}]
[null,null,null,null,null,null,null,null,null,null,31,"KN-001577",null,180783,null,null,"KN",null,null,"当月仕入高","川光商事㈱　2023/06月分",null,20230831,null,"T",null,null,null,null,null,null,null,null,null,null,null,null,null,null,null,null,null,{"$f":"IFERROR(VLOOKUP(L40,Suppliers[[取引先コード\n（SAP）]:[支払条件]],6,0),\"\")","v":"月末〆６０日後払"}]
[null,"20230707","KN",20230630,"SA","JPY",null,"23-06-013","三井物産(富士食品)","X",40,351000,null,1806860,null,null,"KN","KN-0300",null,"当月仕入高","三井物産㈱　富士食品製品　2023/06月分",null,null,null,null,null,null,null,null,null,null,null,null,null,null,null,null,null,null,null,null,null,{"$f":"IFERROR(VLOOKUP(L41,Suppliers[[取引先コード\n（SAP）]:[支払条件]],6,0),\"\")","v":""}]
[null,null,null,null,null,null,null,null,null,null,40,148100,null,144554,null,null,"KN",null,null,"仮払消費税","三井物産㈱　富士食品製品　2023/06月分",null,null,null,null,null,null,null,null,null,null,null,null,null,null,null,null,null,null,null,null,null,{"$f":"IFERROR(VLOOKUP(L42,Suppliers[[取引先コード\n（SAP）]:[支払条件]],6,0),\"\")","v":""}]
[null,null,null,null,null,null,null,null,null,null,31,"KN-001621",null,1951414,null,null,"KN",null,null,"当月仕入高","三井物産㈱　富士食品製品　2023/06月分",null,20230831,null,"T",null,null,null,null,null,null,null,null,null,null,null,null,null,null,null,null,null,{"$f":"IFERROR(VLOOKUP(L43,Suppliers[[取引先コード\n（SAP）]:[支払条件]],6,0),\"\")","v":"月末〆６０日後払"}]
[null,"20230707","KN",20230630,"SA","JPY",null,"23-06-014","創味食品","X",40,351000,null,12750,null,null,"KN","KN-0300",null,"当月仕入高","㈱創味食品　2023/06月分",null,null,null,null,null,null,null,null,null,null,null,null,null,null,null,null,null,null,null,null,null,{"$f":"IFERROR(VLOOKUP(L44,Suppliers[[取引先コード\n（SAP）]:[支払条件]],6,0),\"\")","v":""}]
[null,null,null,null,null,null,null,null,null,null,40,148100,null,1040,null,null,"KN",null,null,"仮払消費税","㈱創味食品　2023/06月分",null,null,null,null,null,null,null,null,null,null,null,null,null,null,null,null,null,null,null,null,null,{"$f":"IFERROR(VLOOKUP(L45,Suppliers[[取引先コード\n（SAP）]:[支払条件]],6,0),\"\")","v":""}]
[null,null,null,null,null,null,null,null,null,null,31,"KN-001645",null,13790,null,null,"KN",null,null,"当月仕入高","㈱創味食品　2023/06月分",null,20230831,null,"T",null,null,null,null,null,null,null,null,null,null,null,null,null,null,null,null,null,{"$f":"IFERROR(VLOOKUP(L46,Suppliers[[取引先コード\n（SAP）]:[支払条件]],6,0),\"\")","v":"月末〆６０日後払"}]
[null,"20230707","KN",20230630,"SA","JPY",null,"23-06-015","丸和油脂","X",40,351000,null,20720,null,null,"KN","KN-0300",null,"当月仕入高","丸和油脂㈱　2023/06月分",null,null,null,null,null,null,null,null,null,null,null,null,null,null,null,null,null,null,null,null,null,{"$f":"IFERROR(VLOOKUP(L47,Suppliers[[取引先コード\n（SAP）]:[支払条件]],6,0),\"\")","v":""}]
[null,null,null,null,null,null,null,null,null,null,40,148100,null,1695,null,null,"KN",null,null,"仮払消費税","丸和油脂㈱　2023/06月分",null,null,null,null,null,null,null,null,null,null,null,null,null,null,null,null,null,null,null,null,null,{"$f":"IFERROR(VLOOKUP(L48,Suppliers[[取引先コード\n（SAP）]:[支払条件]],6,0),\"\")","v":""}]
[null,null,null,null,null,null,null,null,null,null,31,"KN-001720",null,22415,null,null,"KN",null,null,"当月仕入高","丸和油脂㈱　2023/06月分",null,20230831,null,"T",null,null,null,null,null,null,null,null,null,null,null,null,null,null,null,null,null,{"$f":"IFERROR(VLOOKUP(L49,Suppliers[[取引先コード\n（SAP）]:[支払条件]],6,0),\"\")","v":"月末〆６０日後払"}]
[null,"20230707","KN",20230630,"SA","JPY",null,"23-06-016","国分首都圏","X",40,351000,null,406331,null,null,"KN","KN-0300",null,"当月仕入高","国分首都圏株式会社　2023/06月分",null,null,null,null,null,null,null,null,null,null,null,null,null,null,null,null,null,null,null,null,null,{"$f":"IFERROR(VLOOKUP(L50,Suppliers[[取引先コード\n（SAP）]:[支払条件]],6,0),\"\")","v":""}]
[null,null,null,null,null,null,null,null,null,null,40,148100,null,32506,null,null,"KN",null,null,"仮払消費税","国分首都圏株式会社　2023/06月分"]
[null,null,null,null,null,null,null,null,null,null,31,"KN-001775",null,438837,null,null,"KN",null,null,"当月仕入高","国分首都圏株式会社　2023/06月分",null,20230831,null,"T"]
[null,"20230707","KN",20230630,"SA","JPY",null,"23-06-017","日本サンガリア","X",40,351000,null,730020,null,null,"KN","KN-0300",null,"当月仕入高","㈱日本サンガリア　2023/06月分"]
[null,null,null,null,null,null,null,null,null,null,40,148100,null,58395,null,null,"KN",null,null,"仮払消費税","㈱日本サンガリア　2023/06月分"]
[null,null,null,null,null,null,null,null,null,null,31,"KN-001959",null,788415,null,null,"KN",null,null,"当月仕入高","㈱日本サンガリア　2023/06月分",null,20230731,null,"T"]
[null,"20230707","KN",20230630,"SA","JPY",null,"23-06-018","三井物産(ｵｲﾙﾐﾙｽﾞ)","X",40,351000,null,986910,null,null,"KN","KN-0300",null,"当月仕入高","三井物産㈱Ｊ－オイルミルズ　2023/06月分"]
[null,null,null,null,null,null,null,null,null,null,40,148100,null,78953,null,null,"KN",null,null,"仮払消費税","三井物産㈱Ｊ－オイルミルズ　2023/06月分"]
[null,null,null,null,null,null,null,null,null,null,31,"KN-002013",null,1065863,null,null,"KN",null,null,"当月仕入高","三井物産㈱Ｊ－オイルミルズ　2023/06月分",null,20230831,null,"T"]
[null,"20230707","KN",20230630,"SA","JPY",null,"23-06-019","岩井の胡麻油","X",40,351000,null,854380,null,null,"KN","KN-0300",null,"当月仕入高","岩井の胡麻油㈱　2023/06月分"]
[null,null,null,null,null,null,null,null,null,null,40,148100,null,68347,null,null,"KN",null,null,"仮払消費税","岩井の胡麻油㈱　2023/06月分"]
[null,null,null,null,null,null,null,null,null,null,31,"KN-002037",null,922727,null,null,"KN",null,null,"当月仕入高","岩井の胡麻油㈱　2023/06月分",null,20230831,null,"T"]
[null,"20230707","KN",20230630,"SA","JPY",null,"23-06-020","三井物産(かどや)","X",40,351000,null,85400,null,null,"KN","KN-0300",null,"当月仕入高","三井物産㈱　かどや製油　2023/06月分"]
[null,null,null,null,null,null,null,null,null,null,40,148100,null,6832,null,null,"KN",null,null,"仮払消費税","三井物産㈱　かどや製油　2023/06月分"]
[null,null,null,null,null,null,null,null,null,null,31,"KN-002044",null,92232,null,null,"KN",null,null,"当月仕入高","三井物産㈱　かどや製油　2023/06月分",null,20230831,null,"T"]
[null,"20230707","KN",20230630,"SA","JPY",null,"23-06-021","ユアサ・フナショク","X",40,351000,null,419900,null,null,"KN","KN-0300",null,"当月仕入高","ユアサ・フナショク株式会社　2023/06月分"]
[null,null,null,null,null,null,null,null,null,null,40,148100,null,33592,null,null,"KN",null,null,"仮払消費税","ユアサ・フナショク株式会社　2023/06月分"]
[null,null,null,null,null,null,null,null,null,null,31,"KN-002075",null,453492,null,null,"KN",null,null,"当月仕入高","ユアサ・フナショク株式会社　2023/06月分",null,20230630,null,"T"]
[null,"20230707","KN",20230630,"SA","JPY",null,"23-06-022","ダイヤスター","X",40,351000,null,25000,null,null,"KN","KN-0300",null,"当月仕入高","㈱ダイヤスター　2023/06月分"]
[null,null,null,null,null,null,null,null,null,null,40,148100,null,2000,null,null,"KN",null,null,"仮払消費税","㈱ダイヤスター　2023/06月分"]
[null,null,null,null,null,null,null,null,null,null,31,"KN-002150",null,27000,null,null,"KN",null,null,"当月仕入高","㈱ダイヤスター　2023/06月分",null,20230831,null,"T"]
[null,"20230707","KN",20230630,"SA","JPY",null,"23-06-023","上越スタ－チ","X",40,351000,null,116200,null,null,"KN","KN-0300",null,"当月仕入高","上越スタ－チ㈱　2023/06月分"]
[null,null,null,null,null,null,null,null,null,null,40,148100,null,9296,null,null,"KN",null,null,"仮払消費税","上越スタ－チ㈱　2023/06月分"]
[null,null,null,null,null,null,null,null,null,null,31,"KN-002235",null,125496,null,null,"KN",null,null,"当月仕入高","上越スタ－チ㈱　2023/06月分",null,20230831,null,"T"]
[null,"20230707","KN",20230630,"SA","JPY",null,"23-06-024","たかい食品","X",40,351000,null,8000,null,null,"KN","KN-0300",null,"当月仕入高","たかい食品㈱　2023/06月分"]
[null,null,null,null,null,null,null,null,null,null,40,148100,null,664,null,null,"KN",null,null,"仮払消費税","たかい食品㈱　2023/06月分"]
[null,null,null,null,null,null,null,null,null,null,31,"KN-002265",null,8664,null,null,"KN",null,null,"当月仕入高","たかい食品㈱　2023/06月分",null,20230731,null,"T"]
[null,"20230707","KN",20230630,"SA","JPY",null,"23-06-025","マスキチ","X",40,351000,null,64650,null,null,"KN","KN-0300",null,"当月仕入高","㈱マスキチ　2023/06月分"]
[null,null,null,null,null,null,null,null,null,null,40,148100,null,5172,null,null,"KN",null,null,"仮払消費税","㈱マスキチ　2023/06月分"]
[null,null,null,null,null,null,null,null,null,null,31,"KN-002440",null,69822,null,null,"KN",null,null,"当月仕入高","㈱マスキチ　2023/06月分",null,20230831,null,"T"]
[null,"20230707","KN",20230630,"SA","JPY",null,"23-06-026","横関油脂工業","X",40,351000,null,3435300,null,null,"KN","KN-0300",null,"当月仕入高","横関油脂工業㈱　2023/06月分"]
[null,null,null,null,null,null,null,null,null,null,40,148100,null,274824,null,null,"KN",null,null,"仮払消費税","横関油脂工業㈱　2023/06月分"]
[null,null,null,null,null,null,null,null,null,null,31,"KN-002457",null,3710124,null,null,"KN",null,null,"当月仕入高","横関油脂工業㈱　2023/06月分",null,20230831,null,"T"]
[null,"20230707","KN",20230630,"SA","JPY",null,"23-06-027","J-NIKKAﾊﾟｰﾄﾅｰｽﾞ","X",40,351000,null,189200,null,null,"KN","KN-0300",null,"当月仕入高","㈱J-NIKKAﾊﾟｰﾄﾅｰｽﾞ　2023/06月分"]
[null,null,null,null,null,null,null,null,null,null,40,148100,null,15136,null,null,"KN",null,null,"仮払消費税","㈱J-NIKKAﾊﾟｰﾄﾅｰｽﾞ　2023/06月分"]
[null,null,null,null,null,null,null,null,null,null,31,"KN-002495",null,204336,null,null,"KN",null,null,"当月仕入高","㈱J-NIKKAﾊﾟｰﾄﾅｰｽﾞ　2023/06月分",null,20230831,null,"T"]
[null,"20230707","KN",20230630,"SA","JPY",null,"23-06-028","鈴木屋","X",40,351000,null,14847,null,null,"KN","KN-0300",null,"当月仕入高","㈱鈴木屋　2023/06月分"]
[null,null,null,null,null,null,null,null,null,null,40,148100,null,1187,null,null,"KN",null,null,"仮払消費税","㈱鈴木屋　2023/06月分"]
[null,null,null,null,null,null,null,null,null,null,31,"KN-002549",null,16034,null,null,"KN",null,null,"当月仕入高","㈱鈴木屋　2023/06月分",null,20230831,null,"T"]
[null,"20230707","KN",20230630,"SA","JPY",null,"23-06-029","二葉化成株式会社","X",40,351000,null,17000,null,null,"KN","KN-0300",null,"当月仕入高","二葉化成株式会社　2023/06月分"]
[null,null,null,null,null,null,null,null,null,null,40,148100,null,1360,null,null,"KN",null,null,"仮払消費税","二葉化成株式会社　2023/06月分"]
[null,null,null,null,null,null,null,null,null,null,31,"KN-002756",null,18360,null,null,"KN",null,null,"当月仕入高","二葉化成株式会社　2023/06月分",null,20230731,null,"T"]
[null,"20230707","KN",20230630,"SA","JPY",null,"23-06-030","かね善","X",40,351000,null,8000,null,null,"KN","KN-0300",null,"当月仕入高","㈱かね善　2023/06月分"]
[null,null,null,null,null,null,null,null,null,null,40,148100,null,640,null,null,"KN",null,null,"仮払消費税","㈱かね善　2023/06月分"]
[null,null,null,null,null,null,null,null,null,null,31,"KN-002884",null,8640,null,null,"KN",null,null,"当月仕入高","㈱かね善　2023/06月分",null,20230731,null,"T"]
[null,"20230707","KN",20230630,"SA","JPY",null,"23-06-031","住商ﾌｰｽﾞ","X",40,351000,null,8514803,null,null,"KN","KN-0300",null,"当月仕入高","住商ﾌｰｽﾞ株式会社　2023/06月分"]
[null,null,null,null,null,null,null,null,null,null,40,148100,null,681184,null,null,"KN",null,null,"仮払消費税","住商ﾌｰｽﾞ株式会社　2023/06月分"]
[null,null,null,null,null,null,null,null,null,null,31,"KN-000024",null,9195987,null,null,"KN",null,null,"当月仕入高","住商ﾌｰｽﾞ株式会社　2023/06月分",null,20230831,null,"T"]
[null,"20230707","KN",20230630,"SA","JPY",null,"23-06-032","ユアサ・フナショク","X",40,351000,null,396063,null,null,"KN","KN-0300",null,"当月仕入高","ユアサ・フナショク㈱　2023/06月分"]
[null,null,null,null,null,null,null,null,null,null,40,148100,null,31685,null,null,"KN",null,null,"仮払消費税","ユアサ・フナショク㈱　2023/06月分"]
[null,null,null,null,null,null,null,null,null,null,31,"KN-000062",null,427748,null,null,"KN",null,null,"当月仕入高","ユアサ・フナショク㈱　2023/06月分",null,20230915,null,"T"]
[null,"20230707","KN",20230630,"SA","JPY",null,"23-06-033","千葉製粉","X",40,351000,null,110215,null,null,"KN","KN-0300",null,"当月仕入高","千葉製粉㈱　2023/06月分"]
[null,null,null,null,null,null,null,null,null,null,40,148100,null,8817,null,null,"KN",null,null,"仮払消費税","千葉製粉㈱　2023/06月分"]
[null,null,null,null,null,null,null,null,null,null,31,"KN-000222",null,119032,null,null,"KN",null,null,"当月仕入高","千葉製粉㈱　2023/06月分",null,20230820,null,"T"]
[null,"20230707","KN",20230630,"SA","JPY",null,"23-06-034","ﾔﾏｼﾞｮｳ商事","X",40,351000,null,551154,null,null,"KN","KN-0300",null,"当月仕入高","ﾔﾏｼﾞｮｳ商事㈱　2023/06月分"]
[null,null,null,null,null,null,null,null,null,null,40,148100,null,44092,null,null,"KN",null,null,"仮払消費税","ﾔﾏｼﾞｮｳ商事㈱　2023/06月分"]
[null,null,null,null,null,null,null,null,null,null,31,"KN-000280",null,595246,null,null,"KN",null,null,"当月仕入高","ﾔﾏｼﾞｮｳ商事㈱　2023/06月分",null,20230731,null,"T"]
[null,"20230707","KN",20230630,"SA","JPY",null,"23-06-035","杉山商事","X",40,351000,null,526900,null,null,"KN","KN-0300",null,"当月仕入高","杉山商事㈱　2023/06月分"]
[null,null,null,null,null,null,null,null,null,null,40,148100,null,42180,null,null,"KN",null,null,"仮払消費税","杉山商事㈱　2023/06月分"]
[null,null,null,null,null,null,null,null,null,null,31,"KN-000351",null,569080,null,null,"KN",null,null,"当月仕入高","杉山商事㈱　2023/06月分",null,20230731,null,"T"]
[null,"20230707","KN",20230630,"SA","JPY",null,"23-06-036","三井物産(サンヨ－)","X",40,351000,null,955946,null,null,"KN","KN-0300",null,"当月仕入高","三井物産㈱　サンヨ－食品製品　2023/06月分"]
[null,null,null,null,null,null,null,null,null,null,40,148100,null,76476,null,null,"KN",null,null,"仮払消費税","三井物産㈱　サンヨ－食品製品　2023/06月分"]
[null,null,null,null,null,null,null,null,null,null,31,"KN-001010",null,1032422,null,null,"KN",null,null,"当月仕入高","三井物産㈱　サンヨ－食品製品　2023/06月分",null,20230831,null,"T"]
[null,"20230707","KN",20230630,"SA","JPY",null,"23-06-037","明星食品","X",40,351000,null,169777,null,null,"KN","KN-0300",null,"当月仕入高","明星食品㈱　2023/06月分"]
[null,null,null,null,null,null,null,null,null,null,40,148100,null,13582,null,null,"KN",null,null,"仮払消費税","明星食品㈱　2023/06月分"]
[null,null,null,null,null,null,null,null,null,null,31,"KN-001027",null,183359,null,null,"KN",null,null,"当月仕入高","明星食品㈱　2023/06月分",null,20230815,null,"T"]
[null,"20230707","KN",20230630,"SA","JPY",null,"23-06-038","東洋水産","X",40,351000,null,65959,null,null,"KN","KN-0300",null,"当月仕入高","東洋水産㈱　2023/06月分"]
[null,null,null,null,null,null,null,null,null,null,40,148100,null,5275,null,null,"KN",null,null,"仮払消費税","東洋水産㈱　2023/06月分"]
[null,null,null,null,null,null,null,null,null,null,31,"KN-001034",null,71234,null,null,"KN",null,null,"当月仕入高","東洋水産㈱　2023/06月分",null,20230831,null,"T"]
[null,"20230707","KN",20230630,"SA","JPY",null,"23-06-039","赤城食品","X",40,351000,null,190000,null,null,"KN","KN-0300",null,"当月仕入高","赤城食品㈱　2023/06月分"]
[null,null,null,null,null,null,null,null,null,null,40,148100,null,15200,null,null,"KN",null,null,"仮払消費税","赤城食品㈱　2023/06月分"]
[null,null,null,null,null,null,null,null,null,null,31,"KN-001081",null,205200,null,null,"KN",null,null,"当月仕入高","赤城食品㈱　2023/06月分",null,20230731,null,"T"]
[null,"20230707","KN",20230630,"SA","JPY",null,"23-06-040","東海デキストリン","X",40,351000,null,1344100,null,null,"KN","KN-0300",null,"当月仕入高","東海デキストリン株式会社　2023/06月分"]
[null,null,null,null,null,null,null,null,null,null,40,148100,null,107525,null,null,"KN",null,null,"仮払消費税","東海デキストリン株式会社　2023/06月分"]
[null,null,null,null,null,null,null,null,null,null,31,"KN-001155",null,1451625,null,null,"KN",null,null,"当月仕入高","東海デキストリン株式会社　2023/06月分",null,20230731,null,"T"]
[null,"20230707","KN",20230630,"SA","JPY",null,"23-06-041","小堺化学工業","X",40,351000,null,195000,null,null,"KN","KN-0300",null,"当月仕入高","小堺化学工業㈱　2023/06月分"]
[null,null,null,null,null,null,null,null,null,null,40,148100,null,15600,null,null,"KN",null,null,"仮払消費税","小堺化学工業㈱　2023/06月分"]
[null,null,null,null,null,null,null,null,null,null,31,"KN-001161",null,210600,null,null,"KN",null,null,"当月仕入高","小堺化学工業㈱　2023/06月分",null,20230831,null,"T"]
[null,"20230707","KN",20230630,"SA","JPY",null,"23-06-042","太洋食化学","X",40,351000,null,79125,null,null,"KN","KN-0300",null,"当月仕入高","㈲太洋食化学　2023/06月分"]
[null,null,null,null,null,null,null,null,null,null,40,148100,null,6351,null,null,"KN",null,null,"仮払消費税","㈲太洋食化学　2023/06月分"]
[null,null,null,null,null,null,null,null,null,null,31,"KN-001188",null,85476,null,null,"KN",null,null,"当月仕入高","㈲太洋食化学　2023/06月分",null,20230831,null,"T"]
[null,"20230707","KN",20230630,"SA","JPY",null,"23-06-043","真田物産","X",40,351000,null,130560,null,null,"KN","KN-0300",null,"当月仕入高","真田物産㈱　2023/06月分"]
[null,null,null,null,null,null,null,null,null,null,40,148100,null,10444,null,null,"KN",null,null,"仮払消費税","真田物産㈱　2023/06月分"]
[null,null,null,null,null,null,null,null,null,null,31,"KN-001232",null,141004,null,null,"KN",null,null,"当月仕入高","真田物産㈱　2023/06月分",null,20230831,null,"T"]
[null,"20230707","KN",20230630,"SA","JPY",null,"23-06-044","日本コロイド","X",40,351000,null,253000,null,null,"KN","KN-0300",null,"当月仕入高","日本コロイド㈱　2023/06月分"]
[null,null,null,null,null,null,null,null,null,null,40,148100,null,20240,null,null,"KN",null,null,"仮払消費税","日本コロイド㈱　2023/06月分"]
[null,null,null,null,null,null,null,null,null,null,31,"KN-001294",null,273240,null,null,"KN",null,null,"当月仕入高","日本コロイド㈱　2023/06月分",null,20230831,null,"T"]
[null,"20230707","KN",20230630,"SA","JPY",null,"23-06-045","交易食品","X",40,351000,null,89100,null,null,"KN","KN-0300",null,"当月仕入高","交易食品㈱　2023/06月分"]
[null,null,null,null,null,null,null,null,null,null,40,148100,null,7128,null,null,"KN",null,null,"仮払消費税","交易食品㈱　2023/06月分"]
[null,null,null,null,null,null,null,null,null,null,31,"KN-001300",null,96228,null,null,"KN",null,null,"当月仕入高","交易食品㈱　2023/06月分",null,20230831,null,"T"]
[null,"20230707","KN",20230630,"SA","JPY",null,"23-06-046","山印醸造","X",40,351000,null,13500,null,null,"KN","KN-0300",null,"当月仕入高","山印醸造㈱　2023/06月分"]
[null,null,null,null,null,null,null,null,null,null,40,148100,null,1096,null,null,"KN",null,null,"仮払消費税","山印醸造㈱　2023/06月分"]
[null,null,null,null,null,null,null,null,null,null,31,"KN-001348",null,14596,null,null,"KN",null,null,"当月仕入高","山印醸造㈱　2023/06月分",null,20230831,null,"T"]
[null,"20230707","KN",20230630,"SA","JPY",null,"23-06-047","東洋水産(冷食)","X",40,351000,null,149877,null,null,"KN","KN-0300",null,"当月仕入高","東洋水産㈱冷食　2023/06月分"]
[null,null,null,null,null,null,null,null,null,null,40,148100,null,11991,null,null,"KN",null,null,"仮払消費税","東洋水産㈱冷食　2023/06月分"]
[null,null,null,null,null,null,null,null,null,null,31,"KN-001393",null,161868,null,null,"KN",null,null,"当月仕入高","東洋水産㈱冷食　2023/06月分",null,20230831,null,"T"]
[null,"20230707","KN",20230630,"SA","JPY",null,"23-06-048","カネク","X",40,351000,null,68443,null,null,"KN","KN-0300",null,"当月仕入高","カネク株式会社　2023/06月分"]
[null,null,null,null,null,null,null,null,null,null,40,148100,null,5476,null,null,"KN",null,null,"仮払消費税","カネク株式会社　2023/06月分"]
[null,null,null,null,null,null,null,null,null,null,31,"KN-001423",null,73919,null,null,"KN",null,null,"当月仕入高","カネク株式会社　2023/06月分",null,20230831,null,"T"]
[null,"20230707","KN",20230630,"SA","JPY",null,"23-06-049","森井食品","X",40,351000,null,28600,null,null,"KN","KN-0300",null,"当月仕入高","森井食品㈱　2023/06月分"]
[null,null,null,null,null,null,null,null,null,null,40,148100,null,2288,null,null,"KN",null,null,"仮払消費税","森井食品㈱　2023/06月分"]
[null,null,null,null,null,null,null,null,null,null,31,"KN-001478",null,30888,null,null,"KN",null,null,"当月仕入高","森井食品㈱　2023/06月分",null,20230831,null,"T"]
[null,"20230707","KN",20230630,"SA","JPY",null,"23-06-050","フライスタ－","X",40,351000,null,281949,null,null,"KN","KN-0300",null,"当月仕入高","フライスタ－㈱　2023/06月分"]
[null,null,null,null,null,null,null,null,null,null,40,148100,null,22554,null,null,"KN",null,null,"仮払消費税","フライスタ－㈱　2023/06月分"]
[null,null,null,null,null,null,null,null,null,null,31,"KN-001546",null,304503,null,null,"KN",null,null,"当月仕入高","フライスタ－㈱　2023/06月分",null,20230805,null,"T"]
[null,"20230707","KN",20230630,"SA","JPY",null,"23-06-051","横浜食糧","X",40,351000,null,1963,null,null,"KN","KN-0300",null,"当月仕入高","横浜食糧㈱　2023/06月分"]
[null,null,null,null,null,null,null,null,null,null,40,148100,null,157,null,null,"KN",null,null,"仮払消費税","横浜食糧㈱　2023/06月分"]
[null,null,null,null,null,null,null,null,null,null,31,"KN-001553",null,2120,null,null,"KN",null,null,"当月仕入高","横浜食糧㈱　2023/06月分",null,20230831,null,"T"]
[null,"20230707","KN",20230630,"SA","JPY",null,"23-06-052","真富士屋食品","X",40,351000,null,42006,null,null,"KN","KN-0300",null,"当月仕入高","真富士屋食品㈱　2023/06月分"]
[null,null,null,null,null,null,null,null,null,null,40,148100,null,3390,null,null,"KN",null,null,"仮払消費税","真富士屋食品㈱　2023/06月分"]
[null,null,null,null,null,null,null,null,null,null,31,"KN-001652",null,45396,null,null,"KN",null,null,"当月仕入高","真富士屋食品㈱　2023/06月分",null,20230831,null,"T"]
[null,"20230707","KN",20230630,"SA","JPY",null,"23-06-053","エバラ食品工業","X",40,351000,null,20535,null,null,"KN","KN-0300",null,"当月仕入高","エバラ食品工業㈱　2023/06月分"]
[null,null,null,null,null,null,null,null,null,null,40,148100,null,1643,null,null,"KN",null,null,"仮払消費税","エバラ食品工業㈱　2023/06月分"]
[null,null,null,null,null,null,null,null,null,null,31,"KN-001669",null,22178,null,null,"KN",null,null,"当月仕入高","エバラ食品工業㈱　2023/06月分",null,20230825,null,"T"]
[null,"20230707","KN",20230630,"SA","JPY",null,"23-06-054","榮村商店","X",40,351000,null,167905,null,null,"KN","KN-0300",null,"当月仕入高","㈱榮村商店　2023/06月分"]
[null,null,null,null,null,null,null,null,null,null,40,148100,null,13432,null,null,"KN",null,null,"仮払消費税","㈱榮村商店　2023/06月分"]
[null,null,null,null,null,null,null,null,null,null,31,"KN-001676",null,181337,null,null,"KN",null,null,"当月仕入高","㈱榮村商店　2023/06月分",null,20230831,null,"T"]
[null,"20230707","KN",20230630,"SA","JPY",null,"23-06-055","三井物産(丸美屋)","X",40,351000,null,35150,null,null,"KN","KN-0300",null,"当月仕入高","三井物産㈱　丸美屋フ－ズ　2023/06月分"]
[null,null,null,null,null,null,null,null,null,null,40,148100,null,2812,null,null,"KN",null,null,"仮払消費税","三井物産㈱　丸美屋フ－ズ　2023/06月分"]
[null,null,null,null,null,null,null,null,null,null,31,"KN-001690",null,37962,null,null,"KN",null,null,"当月仕入高","三井物産㈱　丸美屋フ－ズ　2023/06月分",null,20230831,null,"T"]
[null,"20230707","KN",20230630,"SA","JPY",null,"23-06-056","平和食品工業","X",40,351000,null,62700,null,null,"KN","KN-0300",null,"当月仕入高","平和食品工業㈱　2023/06月分"]
[null,null,null,null,null,null,null,null,null,null,40,148100,null,5016,null,null,"KN",null,null,"仮払消費税","平和食品工業㈱　2023/06月分"]
[null,null,null,null,null,null,null,null,null,null,31,"KN-001737",null,67716,null,null,"KN",null,null,"当月仕入高","平和食品工業㈱　2023/06月分",null,20230731,null,"T"]
[null,"20230707","KN",20230630,"SA","JPY",null,"23-06-057","太陽商事","X",40,351000,null,180450,null,null,"KN","KN-0300",null,"当月仕入高","太陽商事㈱　2023/06月分"]
[null,null,null,null,null,null,null,null,null,null,40,148100,null,14436,null,null,"KN",null,null,"仮払消費税","太陽商事㈱　2023/06月分"]
[null,null,null,null,null,null,null,null,null,null,31,"KN-001751",null,194886,null,null,"KN",null,null,"当月仕入高","太陽商事㈱　2023/06月分",null,20230831,null,"T"]
[null,"20230707","KN",20230630,"SA","JPY",null,"23-06-058","天狗缶詰","X",40,351000,null,190230,null,null,"KN","KN-0300",null,"当月仕入高","天狗缶詰株式会社　東京営業所　2023/06月分"]
[null,null,null,null,null,null,null,null,null,null,40,148100,null,15214,null,null,"KN",null,null,"仮払消費税","天狗缶詰株式会社　東京営業所　2023/06月分"]
[null,null,null,null,null,null,null,null,null,null,31,"KN-001850",null,205444,null,null,"KN",null,null,"当月仕入高","天狗缶詰株式会社　東京営業所　2023/06月分",null,20230831,null,"T"]
[null,"20230707","KN",20230630,"SA","JPY",null,"23-06-059","三栄フーズ","X",40,351000,null,85691,null,null,"KN","KN-0300",null,"当月仕入高","三栄フーズ株式会社　2023/06月分"]
[null,null,null,null,null,null,null,null,null,null,40,148100,null,6874,null,null,"KN",null,null,"仮払消費税","三栄フーズ株式会社　2023/06月分"]
[null,null,null,null,null,null,null,null,null,null,31,"KN-001898",null,92565,null,null,"KN",null,null,"当月仕入高","三栄フーズ株式会社　2023/06月分",null,20230731,null,"T"]
[null,"20230707","KN",20230630,"SA","JPY",null,"23-06-060","三井物産","X",40,351000,null,75000,null,null,"KN","KN-0300",null,"当月仕入高","三井物産㈱　2023/06月分"]
[null,null,null,null,null,null,null,null,null,null,40,148100,null,6000,null,null,"KN",null,null,"仮払消費税","三井物産㈱　2023/06月分"]
[null,null,null,null,null,null,null,null,null,null,31,"KN-002020",null,81000,null,null,"KN",null,null,"当月仕入高","三井物産㈱　2023/06月分",null,20230831,null,"T"]
[null,"20230707","KN",20230630,"SA","JPY",null,"23-06-061","金田屋","X",40,351000,null,427234,null,null,"KN","KN-0300",null,"当月仕入高","金田屋㈱　2023/06月分"]
[null,null,null,null,null,null,null,null,null,null,40,148100,null,34178,null,null,"KN",null,null,"仮払消費税","金田屋㈱　2023/06月分"]
[null,null,null,null,null,null,null,null,null,null,31,"KN-002303",null,461412,null,null,"KN",null,null,"当月仕入高","金田屋㈱　2023/06月分",null,20230731,null,"T"]
[null,"20230707","KN",20230630,"SA","JPY",null,"23-06-062","丸松物産","X",40,351000,null,27000,null,null,"KN","KN-0300",null,"当月仕入高","丸松物産㈱　2023/06月分"]
[null,null,null,null,null,null,null,null,null,null,40,148100,null,2160,null,null,"KN",null,null,"仮払消費税","丸松物産㈱　2023/06月分"]
[null,null,null,null,null,null,null,null,null,null,31,"KN-002655",null,29160,null,null,"KN",null,null,"当月仕入高","丸松物産㈱　2023/06月分",null,20230831,null,"T"]
[null,"20230707","KN",20230630,"SA","JPY",null,"23-06-063","京浜貿易","X",40,351000,null,65000,null,null,"KN","KN-0300",null,"当月仕入高","京浜貿易㈱　2023/06月分"]
[null,null,null,null,null,null,null,null,null,null,40,148100,null,5200,null,null,"KN",null,null,"仮払消費税","京浜貿易㈱　2023/06月分"]
[null,null,null,null,null,null,null,null,null,null,31,"KN-002661",null,70200,null,null,"KN",null,null,"当月仕入高","京浜貿易㈱　2023/06月分",null,20230831,null,"T"]
[null,"20230707","KN",20230630,"SA","JPY",null,"23-06-064","佐川急便","X",40,351000,null,4800,null,null,"KN","KN-0300",null,"当月仕入高","佐川急便株式会社　2023/06月分"]
[null,null,null,null,null,null,null,null,null,null,40,148100,null,480,null,null,"KN",null,null,"仮払消費税","佐川急便株式会社　2023/06月分"]
[null,null,null,null,null,null,null,null,null,null,31,"KN-002901",null,5280,null,null,"KN",null,null,"当月仕入高","佐川急便株式会社　2023/06月分",null,20230726,null,"T"]
[null,"eof"]

{"sheet":"マスタ管理","index":2,"n_rows":251,"n_cols":25,"rows_kept":251,"cut":false,"hidden":true,"merged":[]}
["部課\nコード","部課名称",null,"勘定\nコード","勘定名称","利/原",null,"仕入先コード\n（SAP）","取引先名称","支払\n方法",null,"統制\n勘定","勘定\nタイプ","特殊仕訳テキスト","特殊仕訳\nコード","借方\n転記","貸方\n転記",null,"貸借","税\nコード","税","支払\n方法","支払\n方法","伝票\nタイプ","取引先\n入力"]
[null,null,null,100014,"現金",null,null,"KN-0Z0100","(株)日新",null,null,412100,"K","買掛金",null,"'21","'31"]
["KN-0100","本部",null,100020,"小口現金",null,null,"KN-000017","三井物産㈱油脂・加工開発営業室",null,null,411100,"K","支払手形","W","'29","'39",null,"借方","AA","課税仕入 10%","D","引落","SA","X"]
["KN-0200","保険",null,100500,"UFJ当座",null,null,"KN-000024","住商ﾌｰｽﾞ株式会社",null,null,415100,"K","未払費用","K","'29","'39",null,"貸方","K8","課税仕入 軽減8%","T","総合振込","AB"]
["KN-0300","食糧",null,109999,"3ヶ月超定期預金",null,null,"KN-000051","㈱内外製粉",null,null,414100,"K","未払金","N","'29","'39",null,null,"A8","課税仕入 8%","C","小切手"]
["KN-0400","不動産",null,111010,"銀行01-当座",null,null,"KN-000062","ユアサ・フナショク㈱",null,null,414300,"K","未払金（有形固定資産）","Q","'29","'39",null,null,"A5","課税仕入 5%","B","手形"]
[null,null,null,111011,"銀行01-当座(仮)",null,null,"KN-000081","隅田商事㈱",null,null,414400,"K","未払金（無形固定資産）","R","'29","'39",null,null,"A0","課税仕入 非課税","A","現金"]
[null,null,null,111012,"銀行01-普通",null,null,"KN-000123","三菱商事㈱ （はくばく・粉）",null,null,418305,"K","代理店勘定預り金","U","'29","'39",null,null,"A9","課税仕入 免税"]
[null,null,null,111013,"銀行01-普通(仮)",null,null,"KN-000130","ヤマト食品㈱東京営業所",null,null,441011,"K","仮受金－運賃（特定）","V","'29","'39",null,null,"UA","課税売上　10%"]
[null,null,null,111018,"銀行01-定期","当座",null,"KN-000141","㈱蜜元研究所",null,null,418307,"K","海外代理店勘定（債務）","Y","'29","'39",null,null,"U8","課税売上　8%"]
[null,null,null,111020,"銀行02-当座","普通",null,"KN-000154","三菱商事㈱（鳥越製粉）",null,null,113100,"D","売掛金",null,"'01","'11",null,null,"U5","課税売上　5%"]
[null,null,null,111021,"銀行02-当座(仮)","当座",null,"KN-000215","㈱ニップン商事コ－ポレ－ション",null,null,145150,"D","固定資産売却未収入金","H","'09","'19",null,null,"U0","課税売上　非課税"]
[null,null,null,111022,"銀行02-普通","当座",null,"KN-000222","千葉製粉㈱",null,null,145130,"D","未収利息","L","'09","'19",null,null,"U9","課税売上　免税"]
[null,null,null,111023,"銀行02-普通(仮)",null,null,"KN-000253","三菱商事ﾗｲﾌｻｲｴﾝｽ㈱",null,null,145100,"D","未収入金","M","'09","'19",null,null,null,"対象外は空欄"]
[null,null,null,111028,"銀行02-定期",null,null,"KN-000270","かちどき製粉㈱",null,null,147105,"D","代理店勘定（債権)","R","'09","'19"]
[null,null,null,111030,"銀行03-当座",null,null,"KN-000280","ﾔﾏｼﾞｮｳ商事㈱",null,null,147107,"D","海外代理店勘定(債権)","S","'09","'19"]
[null,null,null,111031,"銀行03-当座(仮)",null,null,"KN-000351","杉山商事㈱",null,null,147109,"D","関係会社立替金","T","'09","'19"]
[null,null,null,111032,"銀行03-普通",null,null,"KN-001010","三井物産㈱　サンヨ－食品製品",null,null,147101,"D","営業立替金","X","'09","'19"]
[null,null,null,111033,"銀行03-普通(仮)",null,null,"KN-001027","明星食品㈱",null,null,416100,"D","前受金","A","'09","'19"]
[null,null,null,111040,"銀行04－当座",null,null,"KN-001034","東洋水産㈱",null,null,112110,"D","受取手形","W","'09","'19"]
[null,null,null,111041,"銀行04－当座(仮)",null,null,"KN-001081","赤城食品㈱",null,null,441000,"D","仮受金売掛金","C","'09","'19",null,"←2018.12.28追記"]
[null,null,null,111042,"銀行04-普通",null,null,"KN-001111","㈱長谷川商店"]
[null,null,null,111043,"銀行04-普通(仮)",null,null,"KN-001131","コ－ビオンジャパン㈱"]
[null,null,null,112110,"受取手形",null,null,"KN-001155","東海デキストリン株式会社"]
[null,null,null,113100,"売掛金",null,null,"KN-001161","小堺化学工業㈱"]
[null,null,null,114001,"有価証券",null,null,"KN-001171","理研ビタミン㈱"]
[null,null,null,127401,"貯蔵品",null,null,"KN-001188","㈲太洋食化学"]
[null,null,null,142102,"前払金",null,null,"KN-001195","ＡＤＥＫＡケミカルサプライ㈱"]
[null,null,null,142103,"前払リース料",null,null,"KN-001218","チヨダ㈱"]
[null,null,null,144100,"短期貸付金",null,null,"KN-001232","真田物産㈱"]
[null,null,null,144110,"従業員短期貸付金",null,null,"KN-001256","㈱みうら食品"]
[null,null,null,144121,"連結間貸付金（CMS)",null,null,"KN-001273","㈱マコト"]
[null,null,null,145100,"未収入金",null,null,"KN-001294","日本コロイド㈱"]
[null,null,null,145110,"未収消費税",null,null,"KN-001300","交易食品㈱"]
[null,null,null,145130,"未収利息",null,null,"KN-001348","山印醸造㈱"]
[null,null,null,145131,"未収利息(CMS)",null,null,"KN-001355","三井物産㈱　オ－マイ製品"]
[null,null,null,145140,"未収法人税",null,null,"KN-001393","東洋水産㈱冷食"]
[null,null,null,145150,"固定資産売却未収金",null,null,"KN-001411","株式会社協和洋行"]
[null,null,null,145199,"未収入金-調整",null,null,"KN-001423","カネク株式会社"]
[null,null,null,146100,"前渡金",null,null,"KN-001430","㈱はくばく"]
[null,null,null,147100,"立替金（一般）",null,null,"KN-001451","東京保存食糧㈱"]
[null,null,null,147109,"関係会社立替金",null,null,"KN-001478","森井食品㈱"]
[null,null,null,148100,"仮払金",null,null,"KN-001495","木村飲料㈱（吉田工場）"]
[null,null,null,148102,"仮払旅費",null,null,"KN-001522","日本製麻㈱ボルガノ食品事業部"]
[null,null,null,148103,"仮払給料",null,null,"KN-001546","フライスタ－㈱"]
[null,null,null,148105,"仮払社会保険料",null,null,"KN-001553","横浜食糧㈱"]
[null,null,null,148108,"仮払事故費",null,null,"KN-001577","川光商事㈱"]
[null,null,null,148115,"仮払税金(国税)",null,null,"KN-001614","田中製餡㈱"]
[null,null,null,148116,"仮払税金(地方税)",null,null,"KN-001621","三井物産㈱　富士食品製品"]
[null,null,null,148200,"仮払消費税",null,null,"KN-001645","㈱創味食品"]
[null,null,null,150000,"繰延税金資産(流動)",null,null,"KN-001652","真富士屋食品㈱"]
[null,null,null,170001,"貸倒引当金（流動）",null,null,"KN-001669","エバラ食品工業㈱"]
[null,null,null,211100,"建物",null,null,"KN-001676","㈱榮村商店"]
[null,null,null,211900,"償却累計額-建物",null,null,"KN-001690","三井物産㈱　丸美屋フ－ズ"]
[null,null,null,211950,"減損累計額-建物",null,null,"KN-001713","諸口"]
[null,null,null,212100,"構築物",null,null,"KN-001720","丸和油脂㈱"]
[null,null,null,212900,"償却累計額-構築物",null,null,"KN-001737","平和食品工業㈱"]
[null,null,null,212950,"減損累計額-構築物",null,null,"KN-001741","和弘食品㈱"]
[null,null,null,213100,"機械及び装置",null,null,"KN-001751","太陽商事㈱"]
[null,null,null,213101,"機械及び装置(ﾘｰｽ)",null,null,"KN-001775","国分首都圏株式会社"]
[null,null,null,213900,"償却累計額-機械装置",null,null,"KN-001818","福）名古屋ﾗｲﾄﾊｳｽKAN食品開発ｾﾝﾀ"]
[null,null,null,213902,"償却累計額-機装(ﾘｰｽ)",null,null,"KN-001831","大信実業株式会社"]
[null,null,null,215100,"車両運搬具",null,null,"KN-001850","天狗缶詰株式会社　東京営業所"]
[null,null,null,215101,"車両運搬具(リース）",null,null,"KN-001855","ミドリ安全㈱"]
[null,null,null,215900,"償却累計額-車両運搬",null,null,"KN-001898","三栄フーズ株式会社"]
[null,null,null,215902,"償却累計額-車両(ﾘｰｽ)",null,null,"KN-001942","東洋水産㈱スープ"]
[null,null,null,215950,"減損累計額-車両運搬",null,null,"KN-001959","㈱日本サンガリア"]
[null,null,null,216100,"工具器具備品",null,null,"KN-001967","㈱神明"]
[null,null,null,216101,"工具器具備品(ﾘｰｽ)",null,null,"KN-001985","宮島醤油㈱"]
[null,null,null,216900,"償却累計額-工具器具",null,null,"KN-002013","三井物産㈱Ｊ－オイルミルズ"]
[null,null,null,216902,"償却累計額-工具(ﾘｰｽ)",null,null,"KN-002020","三井物産㈱"]
[null,null,null,216950,"減損累計額-工具器具",null,null,"KN-002037","岩井の胡麻油㈱"]
[null,null,null,221000,"土地",null,null,"KN-002044","三井物産㈱　かどや製油"]
[null,null,null,227100,"建設仮勘定",null,null,"KN-002075","ユアサ・フナショク株式会社"]
[null,null,null,232100,"営業権",null,null,"KN-002099","日新蜂蜜㈱"]
[null,null,null,234100,"借地権",null,null,"KN-002150","㈱ダイヤスター"]
[null,null,null,234900,"償却累計額-借地権",null,null,"KN-002198","㈱内田からし"]
[null,null,null,241100,"ソフトウｪア",null,null,"KN-002230","㈱シモヤマ"]
[null,null,null,241501,"ソフトウェア仮勘定",null,null,"KN-002235","上越スタ－チ㈱"]
[null,null,null,241900,"償却累計額-ソフトウ",null,null,"KN-002245","籠島澱粉㈱"]
[null,null,null,242100,"電話利用権",null,null,"KN-002265","たかい食品㈱"]
[null,null,null,242150,"減損累計額-電話加入",null,null,"KN-002285","三幸食品株式会社"]
[null,null,null,261101,"投資有価証券",null,null,"KN-002297","兼松食品㈱"]
[null,null,null,261701,"関係会社株式",null,null,"KN-002303","金田屋㈱"]
[null,null,null,262001,"出資金",null,null,"KN-002305","㈱鈴木屋（砂糖分）"]
[null,null,null,263510,"長期貸付金",null,null,"KN-002310","㈱伊豆フェルメンテ"]
[null,null,null,263531,"従業員長期貸付金",null,null,"KN-002396","㈱相原商店"]
[null,null,null,263601,"ゴルフ会員権",null,null,"KN-002440","㈱マスキチ"]
[null,null,null,264001,"破産更生債権等",null,null,"KN-002457","横関油脂工業㈱"]
[null,null,null,265000,"長期前払費用",null,null,"KN-002495","㈱J-NIKKAﾊﾟｰﾄﾅｰｽﾞ"]
[null,null,null,265900,"償却累計額-長期前払",null,null,"KN-002549","㈱鈴木屋"]
[null,null,null,266000,"繰延税金資産(固定)",null,null,"KN-002655","丸松物産㈱"]
[null,null,null,267100,"敷金",null,null,"KN-002661","京浜貿易㈱"]
[null,null,null,268100,"差入保証金",null,null,"KN-002716","国光オブラート株式会社"]
[null,null,null,268500,"リサイクル預託金",null,null,"KN-002755","桜井製材"]
[null,null,null,269001,"積立保険金",null,null,"KN-002884","㈱かね善"]
[null,null,null,272001,"貸倒引当金（固定）",null,null,"KN-002901","佐川急便株式会社"]
[null,null,null,351000,"売上原価","C"]
[null,null,null,351050,"原価-陸運(社有車)","C"]
[null,null,null,351051,"原価-陸運(傭車)","C"]
[null,null,null,351053,"原価-陸運(原価差額）","C"]
[null,null,null,351060,"原価-倉庫","C"]
[null,null,null,351061,"原価-倉庫(原価差額)","C"]
[null,null,null,351090,"原価-不動産","C"]
[null,null,null,351210,"原価-給与","C"]
[null,null,null,351219,"原価-通勤費","C"]
[null,null,null,351220,"原価-雑給与","C"]
[null,null,null,351222,"原価-賞与引当金繰入","C"]
[null,null,null,351230,"原価-賞与","C"]
[null,null,null,351240,"原価-退職給付費用","C"]
[null,null,null,351241,"原価-従業員退職金","C"]
[null,null,null,351250,"原価-法定福利費","C"]
[null,null,null,351260,"原価-福利厚生費","C"]
[null,null,null,351300,"原価-光熱水道費","C"]
[null,null,null,351400,"原価-修繕費","C"]
[null,null,null,351600,"原価-賃借料","C"]
[null,null,null,351610,"原価-賃借事務所","C"]
[null,null,null,351650,"原価-賃借駐車場","C"]
[null,null,null,351700,"原価-保険","C"]
[null,null,null,351720,"原価-自動車保険","C"]
[null,null,null,351900,"原価-旅費交通費","C"]
[null,null,null,352000,"原価-会議費","C"]
[null,null,null,352100,"原価-通信費","C"]
[null,null,null,352310,"原価-租税公課","C"]
[null,null,null,352400,"原価-用度品費","C"]
[null,null,null,352410,"原価-備品","C"]
[null,null,null,352420,"原価-事務用品代","C"]
[null,null,null,352450,"原価-用紙代","C"]
[null,null,null,352460,"原価-間接(一括償却資","C"]
[null,null,null,352470,"原価-直接(一括償却資","C"]
[null,null,null,352600,"原価-交際費","C"]
[null,null,null,352800,"原価-会費","C"]
[null,null,null,352820,"原価-会費聴講","C"]
[null,null,null,352900,"原価-雑費","C"]
[null,null,null,352910,"原価-雑費金融","C"]
[null,null,null,352990,"原価-減価償却費(直)","C"]
[null,null,null,411100,"支払手形"]
[null,null,null,411910,"割引手形"]
[null,null,null,411920,"譲渡手形"]
[null,null,null,412100,"買掛金"]
[null,null,null,413110,"短期借入金"]
[null,null,null,413410,"一年内返済長期借入金"]
[null,null,null,413701,"リース債務(流動）"]
[null,null,null,413800,"連結会社間借入金（短"]
[null,null,null,413900,"連結間借入金（CMS)"]
[null,null,null,414100,"未払金"]
[null,null,null,414200,"未払配当金"]
[null,null,null,414300,"未払金（有形固定資産"]
[null,null,null,414400,"未払金（無形固定資産"]
[null,null,null,414500,"未払消費税等"]
[null,null,null,414700,"未払事業所税"]
[null,null,null,414800,"未払事業税"]
[null,null,null,414900,"未払法人税等"]
[null,null,null,415100,"未払費用"]
[null,null,null,415102,"未払利息"]
[null,null,null,415103,"未払リース料"]
[null,null,null,415104,"未払利息(CMS)"]
[null,null,null,415199,"未払費用その他"]
[null,null,null,416000,"繰延税金負債（流動）"]
[null,null,null,416100,"前受金"]
[null,null,null,417199,"預り金その他"]
[null,null,null,418100,"賞与引当金"]
[null,null,null,422100,"仮受消費税"]
[null,null,null,441000,"仮受金売掛金"]
[null,null,null,441008,"仮受金（一般）"]
[null,null,null,441033,"仮受金-UFJ東京営業"]
[null,null,null,462100,"原価仮勘定"]
[null,null,null,514100,"長期借入金"]
[null,null,null,515000,"リース債務(固定）"]
[null,null,null,516000,"連結会社間借入金（長"]
[null,null,null,568000,"繰延税金負債(固定)"]
[null,null,null,572100,"退職給付引当金"]
[null,null,null,572200,"役員退職慰労引当金"]
[null,null,null,711000,"資本金"]
[null,null,null,721000,"資本準備金"]
[null,null,null,726000,"利益準備金"]
[null,null,null,731400,"別途積立金"]
[null,null,null,733100,"未処分利益-繰越利益"]
[null,null,null,733200,"未処分利益-当期利益"]
[null,null,null,733400,"当期未処分利益"]
[null,null,null,733520,"中間配当金"]
[null,null,null,741000,"他有価証券評価差額"]
[null,null,null,811100,"売上","P"]
[null,null,null,811150,"売上-陸運(社有車)","P"]
[null,null,null,811151,"売上-陸運(傭車)","P"]
[null,null,null,811160,"売上-倉庫","P"]
[null,null,null,811190,"売上-不動産","P"]
[null,null,null,824100,"管理-役員報酬","C"]
[null,null,null,824200,"管理-職員給与","C"]
[null,null,null,824300,"管理-雑給与","C"]
[null,null,null,824310,"管理-派遣給与","C"]
[null,null,null,824320,"管理-通勤費","C"]
[null,null,null,824500,"管理-役員賞与","C"]
[null,null,null,824600,"管理-賞与引当金繰入","C"]
[null,null,null,824700,"管理-賞与","C"]
[null,null,null,824800,"管理-退職給付費用","C"]
[null,null,null,824810,"管理-従業員退職金","C"]
[null,null,null,824900,"管理-法定福利費","C"]
[null,null,null,825000,"管理-福利厚生費","C"]
[null,null,null,825100,"管理-役退引当金繰入","C"]
[null,null,null,825120,"管理-外部委託費","C"]
[null,null,null,825200,"管理-光熱水道費","C"]
[null,null,null,825500,"管理-賃借料","C"]
[null,null,null,825520,"管理-賃借事務器","C"]
[null,null,null,825540,"管理-賃借システム","C"]
[null,null,null,825600,"管理-修繕費","C"]
[null,null,null,825700,"管理-広告宣伝費","C"]
[null,null,null,826000,"管理-保険料","C"]
[null,null,null,826200,"管理-旅費交通費","C"]
[null,null,null,826300,"管理-会議費","C"]
[null,null,null,826400,"管理-通信費","C"]
[null,null,null,826500,"管理-寄付金","C"]
[null,null,null,826600,"管理-租税公課","C"]
[null,null,null,826610,"管理-事業所税","C"]
[null,null,null,826620,"管理-事業税","C"]
[null,null,null,826700,"管理-用度品費","C"]
[null,null,null,826710,"管理-備品","C"]
[null,null,null,826720,"管理-事務用品","C"]
[null,null,null,826730,"管理-印刷代","C"]
[null,null,null,826760,"管理-用品( 一括償却","C"]
[null,null,null,826780,"管理-図書費","C"]
[null,null,null,826800,"管理-交際費","C"]
[null,null,null,826900,"管理-会費","C"]
[null,null,null,826920,"管理-会費聴講","C"]
[null,null,null,827000,"管理-減価償却費","C"]
[null,null,null,827100,"管理-貸倒引当金繰入","C"]
[null,null,null,827200,"管理-貸倒償却","C"]
[null,null,null,827900,"管理-雑費","C"]
[null,null,null,827910,"管理-雑費金融","C"]
[null,null,null,861000,"受取利息","P"]
[null,null,null,862000,"受取配当金","P"]
[null,null,null,865710,"外収その他","P"]
[null,null,null,878310,"固定資産売却益","P"]
[null,null,null,878320,"投有証券売却益","P"]
[null,null,null,878399,"特益その他","P"]
[null,null,null,881000,"支払利息","C"]
[null,null,null,881100,"借入金利息","C"]
[null,null,null,882000,"事故費","C"]
[null,null,null,884710,"外費その他","C"]
[null,null,null,885110,"固定資産売却損","C"]
[null,null,null,885120,"固定資産除却損","C"]
[null,null,null,885130,"減損損失","C"]
[null,null,null,885140,"固定資産撤去費用等","C"]
[null,null,null,885150,"投資有価証券売却損","C"]
[null,null,null,885160,"投資有価証券評価損","C"]
[null,null,null,885199,"特損その他","C"]
[null,null,null,896310,"固定資産除却 仮勘定"]
[null,null,null,981000,"法人税","C"]
[null,null,null,983000,"住民税","C"]
[null,null,null,984000,"事業税","C"]
[null,null,null,985000,"法人税等調整額"]

{"sheet":"仕入先マスタ管理","index":3,"n_rows":365,"n_cols":12,"rows_kept":365,"cut":false,"hidden":false,"merged":[]}
["取引先コード\n（カクテル）","取引先コード\n（SAP）","取引先名称","省略名称（半角18,全角9文字以下）","文字数\n（半角）","支払条件コード","支払条件","Month","Day"]
["-","KN-000001","明治安田収納ビジネスサービス（株）","明治安田収納ﾋﾞｼﾞﾈｽ",{"$f":"LENB(Suppliers[[#This Row],[省略名称（半角18,全角9文字以下）]])","v":18},"11VV",{"$f":"VLOOKUP(Suppliers[[#This Row],[支払条件コード]],PmtTerms[#All],2,0)","v":"月末〆３０日後払"},{"$f":"IFERROR(VLOOKUP(Suppliers[[#This Row],[支払条件コード]],PmtTerms[],3,0),\"\")","v":2},{"$f":"IFERROR(VLOOKUP(Suppliers[[#This Row],[支払条件コード]],PmtTerms[],4,0),\"\")","v":0},null,"取引先マスタが追加された際"]
["-","KN-000002","（株）アプラス","アプラス",{"$f":"LENB(Suppliers[[#This Row],[省略名称（半角18,全角9文字以下）]])","v":8},"0001",{"$f":"VLOOKUP(Suppliers[[#This Row],[支払条件コード]],PmtTerms[#All],2,0)","v":"計上後即時"},{"$f":"IFERROR(VLOOKUP(Suppliers[[#This Row],[支払条件コード]],PmtTerms[],3,0),\"\")","v":0},{"$f":"IFERROR(VLOOKUP(Suppliers[[#This Row],[支払条件コード]],PmtTerms[],4,0),\"\")","v":0},null,1,"本シートで取引先マスタを追加してください。"]
["-","KN-000003","東京海上日動火災保険（株）","東京海上日動",{"$f":"LENB(Suppliers[[#This Row],[省略名称（半角18,全角9文字以下）]])","v":12},"11VV",{"$f":"VLOOKUP(Suppliers[[#This Row],[支払条件コード]],PmtTerms[#All],2,0)","v":"月末〆３０日後払"},{"$f":"IFERROR(VLOOKUP(Suppliers[[#This Row],[支払条件コード]],PmtTerms[],3,0),\"\")","v":2},{"$f":"IFERROR(VLOOKUP(Suppliers[[#This Row],[支払条件コード]],PmtTerms[],4,0),\"\")","v":0},null,null,"※「売掛金バッチシート」内の「得意先マスタ管理」には後で内容を反映させます。"]
["-","KN-000004","アフラック生命保険株式会社","アフラック生命保険",{"$f":"LENB(Suppliers[[#This Row],[省略名称（半角18,全角9文字以下）]])","v":18},"11VV",{"$f":"VLOOKUP(Suppliers[[#This Row],[支払条件コード]],PmtTerms[#All],2,0)","v":"月末〆３０日後払"},{"$f":"IFERROR(VLOOKUP(Suppliers[[#This Row],[支払条件コード]],PmtTerms[],3,0),\"\")","v":2},{"$f":"IFERROR(VLOOKUP(Suppliers[[#This Row],[支払条件コード]],PmtTerms[],4,0),\"\")","v":0},null,2,"なお、「省略名称」が半額18,全角9文字を超えるとR3入力時にエラーが発生します。"]
["-","KN-000005","SOMPOひまわり生命保険（株）","SOMPOひまわり生命",{"$f":"LENB(Suppliers[[#This Row],[省略名称（半角18,全角9文字以下）]])","v":17},"11VV",{"$f":"VLOOKUP(Suppliers[[#This Row],[支払条件コード]],PmtTerms[#All],2,0)","v":"月末〆３０日後払"},{"$f":"IFERROR(VLOOKUP(Suppliers[[#This Row],[支払条件コード]],PmtTerms[],3,0),\"\")","v":2},{"$f":"IFERROR(VLOOKUP(Suppliers[[#This Row],[支払条件コード]],PmtTerms[],4,0),\"\")","v":0},null,3,"「支払条件コード」は「支払条件コード」シートを参照し、入力してください。"]
["-","KN-000006","有限会社丸清製麺","丸清製麺",{"$f":"LENB(Suppliers[[#This Row],[省略名称（半角18,全角9文字以下）]])","v":8},"0001",{"$f":"VLOOKUP(Suppliers[[#This Row],[支払条件コード]],PmtTerms[#All],2,0)","v":"計上後即時"},{"$f":"IFERROR(VLOOKUP(Suppliers[[#This Row],[支払条件コード]],PmtTerms[],3,0),\"\")","v":0},{"$f":"IFERROR(VLOOKUP(Suppliers[[#This Row],[支払条件コード]],PmtTerms[],4,0),\"\")","v":0},null,4,"「売掛金バッチシート」内の「得意先マスタ管理」にA～D列をコピペします。"]
["-","KN-000007","昭和日タン株式会社","昭和日タン",{"$f":"LENB(Suppliers[[#This Row],[省略名称（半角18,全角9文字以下）]])","v":10},"0001",{"$f":"VLOOKUP(Suppliers[[#This Row],[支払条件コード]],PmtTerms[#All],2,0)","v":"計上後即時"},{"$f":"IFERROR(VLOOKUP(Suppliers[[#This Row],[支払条件コード]],PmtTerms[],3,0),\"\")","v":0},{"$f":"IFERROR(VLOOKUP(Suppliers[[#This Row],[支払条件コード]],PmtTerms[],4,0),\"\")","v":0}]
["-","KN-000008","昭和日タンマリタイム株式会社","昭和日タンﾏﾘﾝﾀｲﾑ",{"$f":"LENB(Suppliers[[#This Row],[省略名称（半角18,全角9文字以下）]])","v":16},"0001",{"$f":"VLOOKUP(Suppliers[[#This Row],[支払条件コード]],PmtTerms[#All],2,0)","v":"計上後即時"},{"$f":"IFERROR(VLOOKUP(Suppliers[[#This Row],[支払条件コード]],PmtTerms[],3,0),\"\")","v":0},{"$f":"IFERROR(VLOOKUP(Suppliers[[#This Row],[支払条件コード]],PmtTerms[],4,0),\"\")","v":0}]
["-","KN-000009","シノトランス株式会社","シノトランス",{"$f":"LENB(Suppliers[[#This Row],[省略名称（半角18,全角9文字以下）]])","v":12},"0001",{"$f":"VLOOKUP(Suppliers[[#This Row],[支払条件コード]],PmtTerms[#All],2,0)","v":"計上後即時"},{"$f":"IFERROR(VLOOKUP(Suppliers[[#This Row],[支払条件コード]],PmtTerms[],3,0),\"\")","v":0},{"$f":"IFERROR(VLOOKUP(Suppliers[[#This Row],[支払条件コード]],PmtTerms[],4,0),\"\")","v":0}]
["-","KN-000010","株式会社マルエス","マルエス",{"$f":"LENB(Suppliers[[#This Row],[省略名称（半角18,全角9文字以下）]])","v":8},"0001",{"$f":"VLOOKUP(Suppliers[[#This Row],[支払条件コード]],PmtTerms[#All],2,0)","v":"計上後即時"},{"$f":"IFERROR(VLOOKUP(Suppliers[[#This Row],[支払条件コード]],PmtTerms[],3,0),\"\")","v":0},{"$f":"IFERROR(VLOOKUP(Suppliers[[#This Row],[支払条件コード]],PmtTerms[],4,0),\"\")","v":0}]
["0000000000017","KN-000017","三井物産㈱油脂・加工開発営業室","三井物産(油脂加工)",{"$f":"LENB(Suppliers[[#This Row],[省略名称（半角18,全角9文字以下）]])","v":18},"13VF",{"$f":"VLOOKUP(Suppliers[[#This Row],[支払条件コード]],PmtTerms[#All],2,0)","v":"月末〆７５日後払"},{"$f":"IFERROR(VLOOKUP(Suppliers[[#This Row],[支払条件コード]],PmtTerms[],3,0),\"\")","v":3},{"$f":"IFERROR(VLOOKUP(Suppliers[[#This Row],[支払条件コード]],PmtTerms[],4,0),\"\")","v":15}]
["-","KN-000023","新日石内航サービス株式会社","新日石内航サービス",{"$f":"LENB(Suppliers[[#This Row],[省略名称（半角18,全角9文字以下）]])","v":18},"0001",{"$f":"VLOOKUP(Suppliers[[#This Row],[支払条件コード]],PmtTerms[#All],2,0)","v":"計上後即時"},{"$f":"IFERROR(VLOOKUP(Suppliers[[#This Row],[支払条件コード]],PmtTerms[],3,0),\"\")","v":0},{"$f":"IFERROR(VLOOKUP(Suppliers[[#This Row],[支払条件コード]],PmtTerms[],4,0),\"\")","v":0}]
["0000000000024","KN-000024","住商ﾌｰｽﾞ株式会社","住商ﾌｰｽﾞ",{"$f":"LENB(Suppliers[[#This Row],[省略名称（半角18,全角9文字以下）]])","v":8},"12VV",{"$f":"VLOOKUP(Suppliers[[#This Row],[支払条件コード]],PmtTerms[#All],2,0)","v":"月末〆６０日後払"},{"$f":"IFERROR(VLOOKUP(Suppliers[[#This Row],[支払条件コード]],PmtTerms[],3,0),\"\")","v":3},{"$f":"IFERROR(VLOOKUP(Suppliers[[#This Row],[支払条件コード]],PmtTerms[],4,0),\"\")","v":0}]
["-","KN-000033","株式会社博産","博産",{"$f":"LENB(Suppliers[[#This Row],[省略名称（半角18,全角9文字以下）]])","v":4},"0001",{"$f":"VLOOKUP(Suppliers[[#This Row],[支払条件コード]],PmtTerms[#All],2,0)","v":"計上後即時"},{"$f":"IFERROR(VLOOKUP(Suppliers[[#This Row],[支払条件コード]],PmtTerms[],3,0),\"\")","v":0},{"$f":"IFERROR(VLOOKUP(Suppliers[[#This Row],[支払条件コード]],PmtTerms[],4,0),\"\")","v":0}]
["-","KN-000035","株式会社PDN","PDN",{"$f":"LENB(Suppliers[[#This Row],[省略名称（半角18,全角9文字以下）]])","v":3},"0001",{"$f":"VLOOKUP(Suppliers[[#This Row],[支払条件コード]],PmtTerms[#All],2,0)","v":"計上後即時"},{"$f":"IFERROR(VLOOKUP(Suppliers[[#This Row],[支払条件コード]],PmtTerms[],3,0),\"\")","v":0},{"$f":"IFERROR(VLOOKUP(Suppliers[[#This Row],[支払条件コード]],PmtTerms[],4,0),\"\")","v":0}]
["-","KN-000036","アールケーエス株式会社","アールケーエス",{"$f":"LENB(Suppliers[[#This Row],[省略名称（半角18,全角9文字以下）]])","v":14},"0001",{"$f":"VLOOKUP(Suppliers[[#This Row],[支払条件コード]],PmtTerms[#All],2,0)","v":"計上後即時"},{"$f":"IFERROR(VLOOKUP(Suppliers[[#This Row],[支払条件コード]],PmtTerms[],3,0),\"\")","v":0},{"$f":"IFERROR(VLOOKUP(Suppliers[[#This Row],[支払条件コード]],PmtTerms[],4,0),\"\")","v":0}]
["-","KN-000037","株式会社アラキ製作所","アラキ製作所",{"$f":"LENB(Suppliers[[#This Row],[省略名称（半角18,全角9文字以下）]])","v":12},"0001",{"$f":"VLOOKUP(Suppliers[[#This Row],[支払条件コード]],PmtTerms[#All],2,0)","v":"計上後即時"},{"$f":"IFERROR(VLOOKUP(Suppliers[[#This Row],[支払条件コード]],PmtTerms[],3,0),\"\")","v":0},{"$f":"IFERROR(VLOOKUP(Suppliers[[#This Row],[支払条件コード]],PmtTerms[],4,0),\"\")","v":0}]
["-","KN-000038","株式会社コクセン","コクセン",{"$f":"LENB(Suppliers[[#This Row],[省略名称（半角18,全角9文字以下）]])","v":8},"0001",{"$f":"VLOOKUP(Suppliers[[#This Row],[支払条件コード]],PmtTerms[#All],2,0)","v":"計上後即時"},{"$f":"IFERROR(VLOOKUP(Suppliers[[#This Row],[支払条件コード]],PmtTerms[],3,0),\"\")","v":0},{"$f":"IFERROR(VLOOKUP(Suppliers[[#This Row],[支払条件コード]],PmtTerms[],4,0),\"\")","v":0}]
["-","KN-000039","有限会社マルカワ運輸","マルカワ運輸",{"$f":"LENB(Suppliers[[#This Row],[省略名称（半角18,全角9文字以下）]])","v":12},"0001",{"$f":"VLOOKUP(Suppliers[[#This Row],[支払条件コード]],PmtTerms[#All],2,0)","v":"計上後即時"},{"$f":"IFERROR(VLOOKUP(Suppliers[[#This Row],[支払条件コード]],PmtTerms[],3,0),\"\")","v":0},{"$f":"IFERROR(VLOOKUP(Suppliers[[#This Row],[支払条件コード]],PmtTerms[],4,0),\"\")","v":0}]
["-","KN-000040","三光株式会社","三光",{"$f":"LENB(Suppliers[[#This Row],[省略名称（半角18,全角9文字以下）]])","v":4},"0001",{"$f":"VLOOKUP(Suppliers[[#This Row],[支払条件コード]],PmtTerms[#All],2,0)","v":"計上後即時"},{"$f":"IFERROR(VLOOKUP(Suppliers[[#This Row],[支払条件コード]],PmtTerms[],3,0),\"\")","v":0},{"$f":"IFERROR(VLOOKUP(Suppliers[[#This Row],[支払条件コード]],PmtTerms[],4,0),\"\")","v":0}]
["-","KN-000041","有限会社弘和","弘和",{"$f":"LENB(Suppliers[[#This Row],[省略名称（半角18,全角9文字以下）]])","v":4},"0001",{"$f":"VLOOKUP(Suppliers[[#This Row],[支払条件コード]],PmtTerms[#All],2,0)","v":"計上後即時"},{"$f":"IFERROR(VLOOKUP(Suppliers[[#This Row],[支払条件コード]],PmtTerms[],3,0),\"\")","v":0},{"$f":"IFERROR(VLOOKUP(Suppliers[[#This Row],[支払条件コード]],PmtTerms[],4,0),\"\")","v":0}]
["-","KN-000042","東京海上日動火災保険（株）","東京海上日動",{"$f":"LENB(Suppliers[[#This Row],[省略名称（半角18,全角9文字以下）]])","v":12},"11VV",{"$f":"VLOOKUP(Suppliers[[#This Row],[支払条件コード]],PmtTerms[#All],2,0)","v":"月末〆３０日後払"},{"$f":"IFERROR(VLOOKUP(Suppliers[[#This Row],[支払条件コード]],PmtTerms[],3,0),\"\")","v":2},{"$f":"IFERROR(VLOOKUP(Suppliers[[#This Row],[支払条件コード]],PmtTerms[],4,0),\"\")","v":0}]
["-","KN-000043","損害保険ジャパン（株）","損害保険ジャパン",{"$f":"LENB(Suppliers[[#This Row],[省略名称（半角18,全角9文字以下）]])","v":16},"11VV",{"$f":"VLOOKUP(Suppliers[[#This Row],[支払条件コード]],PmtTerms[#All],2,0)","v":"月末〆３０日後払"},{"$f":"IFERROR(VLOOKUP(Suppliers[[#This Row],[支払条件コード]],PmtTerms[],3,0),\"\")","v":2},{"$f":"IFERROR(VLOOKUP(Suppliers[[#This Row],[支払条件コード]],PmtTerms[],4,0),\"\")","v":0}]
["-","KN-000044","あいおいニッセイ同和損害保険（株）","あいおいﾆｯｾｲ同和",{"$f":"LENB(Suppliers[[#This Row],[省略名称（半角18,全角9文字以下）]])","v":16},"11VV",{"$f":"VLOOKUP(Suppliers[[#This Row],[支払条件コード]],PmtTerms[#All],2,0)","v":"月末〆３０日後払"},{"$f":"IFERROR(VLOOKUP(Suppliers[[#This Row],[支払条件コード]],PmtTerms[],3,0),\"\")","v":2},{"$f":"IFERROR(VLOOKUP(Suppliers[[#This Row],[支払条件コード]],PmtTerms[],4,0),\"\")","v":0}]
["-","KN-000045","トヨタファイナンス（株）","トヨタファイナンス",{"$f":"LENB(Suppliers[[#This Row],[省略名称（半角18,全角9文字以下）]])","v":18},"12VV",{"$f":"VLOOKUP(Suppliers[[#This Row],[支払条件コード]],PmtTerms[#All],2,0)","v":"月末〆６０日後払"},{"$f":"IFERROR(VLOOKUP(Suppliers[[#This Row],[支払条件コード]],PmtTerms[],3,0),\"\")","v":3},{"$f":"IFERROR(VLOOKUP(Suppliers[[#This Row],[支払条件コード]],PmtTerms[],4,0),\"\")","v":0}]
["-","KN-000046","NTTファイナンス（株）","NTTファイナンス",{"$f":"LENB(Suppliers[[#This Row],[省略名称（半角18,全角9文字以下）]])","v":15},"11VV",{"$f":"VLOOKUP(Suppliers[[#This Row],[支払条件コード]],PmtTerms[#All],2,0)","v":"月末〆３０日後払"},{"$f":"IFERROR(VLOOKUP(Suppliers[[#This Row],[支払条件コード]],PmtTerms[],3,0),\"\")","v":2},{"$f":"IFERROR(VLOOKUP(Suppliers[[#This Row],[支払条件コード]],PmtTerms[],4,0),\"\")","v":0}]
["-","KN-000047","三井住友海上火災保険（株）","三井住友海上",{"$f":"LENB(Suppliers[[#This Row],[省略名称（半角18,全角9文字以下）]])","v":12},"11VV",{"$f":"VLOOKUP(Suppliers[[#This Row],[支払条件コード]],PmtTerms[#All],2,0)","v":"月末〆３０日後払"},{"$f":"IFERROR(VLOOKUP(Suppliers[[#This Row],[支払条件コード]],PmtTerms[],3,0),\"\")","v":2},{"$f":"IFERROR(VLOOKUP(Suppliers[[#This Row],[支払条件コード]],PmtTerms[],4,0),\"\")","v":0}]
["-","KN-000048","（株）横浜銀行　","横浜銀行",{"$f":"LENB(Suppliers[[#This Row],[省略名称（半角18,全角9文字以下）]])","v":8},"11V5",{"$f":"VLOOKUP(Suppliers[[#This Row],[支払条件コード]],PmtTerms[#All],2,0)","v":"月末〆５日後払"},{"$f":"IFERROR(VLOOKUP(Suppliers[[#This Row],[支払条件コード]],PmtTerms[],3,0),\"\")","v":1},{"$f":"IFERROR(VLOOKUP(Suppliers[[#This Row],[支払条件コード]],PmtTerms[],4,0),\"\")","v":5}]
["-","KN-000049","（株）三菱UFJ銀行","三菱UFJ銀行",{"$f":"LENB(Suppliers[[#This Row],[省略名称（半角18,全角9文字以下）]])","v":11},"11VK",{"$f":"VLOOKUP(Suppliers[[#This Row],[支払条件コード]],PmtTerms[#All],2,0)","v":"月末〆２０日後払"},{"$f":"IFERROR(VLOOKUP(Suppliers[[#This Row],[支払条件コード]],PmtTerms[],3,0),\"\")","v":1},{"$f":"IFERROR(VLOOKUP(Suppliers[[#This Row],[支払条件コード]],PmtTerms[],4,0),\"\")","v":20}]
["-","KN-000050","三菱オートリース（株）","三菱オートリース",{"$f":"LENB(Suppliers[[#This Row],[省略名称（半角18,全角9文字以下）]])","v":16},"11VP",{"$f":"VLOOKUP(Suppliers[[#This Row],[支払条件コード]],PmtTerms[#All],2,0)","v":"月末〆２５日後払"},{"$f":"IFERROR(VLOOKUP(Suppliers[[#This Row],[支払条件コード]],PmtTerms[],3,0),\"\")","v":1},{"$f":"IFERROR(VLOOKUP(Suppliers[[#This Row],[支払条件コード]],PmtTerms[],4,0),\"\")","v":25}]
["0000000000051","KN-000051","㈱内外製粉","内外製粉",{"$f":"LENB(Suppliers[[#This Row],[省略名称（半角18,全角9文字以下）]])","v":8},"11VV",{"$f":"VLOOKUP(Suppliers[[#This Row],[支払条件コード]],PmtTerms[#All],2,0)","v":"月末〆３０日後払"},{"$f":"IFERROR(VLOOKUP(Suppliers[[#This Row],[支払条件コード]],PmtTerms[],3,0),\"\")","v":2},{"$f":"IFERROR(VLOOKUP(Suppliers[[#This Row],[支払条件コード]],PmtTerms[],4,0),\"\")","v":0}]
["-","KN-000052","ユニマットライフ","ユニマットライフ",{"$f":"LENB(Suppliers[[#This Row],[省略名称（半角18,全角9文字以下）]])","v":16},"11VP",{"$f":"VLOOKUP(Suppliers[[#This Row],[支払条件コード]],PmtTerms[#All],2,0)","v":"月末〆２５日後払"},{"$f":"IFERROR(VLOOKUP(Suppliers[[#This Row],[支払条件コード]],PmtTerms[],3,0),\"\")","v":1},{"$f":"IFERROR(VLOOKUP(Suppliers[[#This Row],[支払条件コード]],PmtTerms[],4,0),\"\")","v":25}]
["-","KN-000053","コスモウォーター","コスモウォーター",{"$f":"LENB(Suppliers[[#This Row],[省略名称（半角18,全角9文字以下）]])","v":16},"11VR",{"$f":"VLOOKUP(Suppliers[[#This Row],[支払条件コード]],PmtTerms[#All],2,0)","v":"月末〆２７日後払"},{"$f":"IFERROR(VLOOKUP(Suppliers[[#This Row],[支払条件コード]],PmtTerms[],3,0),\"\")","v":1},{"$f":"IFERROR(VLOOKUP(Suppliers[[#This Row],[支払条件コード]],PmtTerms[],4,0),\"\")","v":27}]
["-","KN-000054","ダイヤオフィスシステム（株）","ﾀﾞｲﾔｵﾌｨｽｼｽﾃﾑ",{"$f":"LENB(Suppliers[[#This Row],[省略名称（半角18,全角9文字以下）]])","v":12},"11VV",{"$f":"VLOOKUP(Suppliers[[#This Row],[支払条件コード]],PmtTerms[#All],2,0)","v":"月末〆３０日後払"},{"$f":"IFERROR(VLOOKUP(Suppliers[[#This Row],[支払条件コード]],PmtTerms[],3,0),\"\")","v":2},{"$f":"IFERROR(VLOOKUP(Suppliers[[#This Row],[支払条件コード]],PmtTerms[],4,0),\"\")","v":0}]
["-","KN-000055","サイボウズ（株）","サイボウズ",{"$f":"LENB(Suppliers[[#This Row],[省略名称（半角18,全角9文字以下）]])","v":10},"12VV",{"$f":"VLOOKUP(Suppliers[[#This Row],[支払条件コード]],PmtTerms[#All],2,0)","v":"月末〆６０日後払"},{"$f":"IFERROR(VLOOKUP(Suppliers[[#This Row],[支払条件コード]],PmtTerms[],3,0),\"\")","v":3},{"$f":"IFERROR(VLOOKUP(Suppliers[[#This Row],[支払条件コード]],PmtTerms[],4,0),\"\")","v":0}]
["-","KN-000056","NTTコミュニケーションズ（株）","NTTｺﾐｭﾆｹｰｼｮﾝｽﾞ",{"$f":"LENB(Suppliers[[#This Row],[省略名称（半角18,全角9文字以下）]])","v":14},"11VV",{"$f":"VLOOKUP(Suppliers[[#This Row],[支払条件コード]],PmtTerms[#All],2,0)","v":"月末〆３０日後払"},{"$f":"IFERROR(VLOOKUP(Suppliers[[#This Row],[支払条件コード]],PmtTerms[],3,0),\"\")","v":2},{"$f":"IFERROR(VLOOKUP(Suppliers[[#This Row],[支払条件コード]],PmtTerms[],4,0),\"\")","v":0}]
["-","KN-000057","ソフトバンク（株）","ソフトバンク",{"$f":"LENB(Suppliers[[#This Row],[省略名称（半角18,全角9文字以下）]])","v":12},"11VP",{"$f":"VLOOKUP(Suppliers[[#This Row],[支払条件コード]],PmtTerms[#All],2,0)","v":"月末〆２５日後払"},{"$f":"IFERROR(VLOOKUP(Suppliers[[#This Row],[支払条件コード]],PmtTerms[],3,0),\"\")","v":1},{"$f":"IFERROR(VLOOKUP(Suppliers[[#This Row],[支払条件コード]],PmtTerms[],4,0),\"\")","v":25}]
["-","KN-000058","シャープファイナンス","ｼｬｰﾌﾟﾌｧｲﾅﾝｽ",{"$f":"LENB(Suppliers[[#This Row],[省略名称（半角18,全角9文字以下）]])","v":11},"11K5",{"$f":"VLOOKUP(Suppliers[[#This Row],[支払条件コード]],PmtTerms[#All],2,0)","v":"２０日〆１５日後払"},{"$f":"IFERROR(VLOOKUP(Suppliers[[#This Row],[支払条件コード]],PmtTerms[],3,0),\"\")","v":1},{"$f":"IFERROR(VLOOKUP(Suppliers[[#This Row],[支払条件コード]],PmtTerms[],4,0),\"\")","v":5}]
["-","KN-000059","三菱UFJニコス（株）","三菱UFJニコス",{"$f":"LENB(Suppliers[[#This Row],[省略名称（半角18,全角9文字以下）]])","v":13},"12VA",{"$f":"VLOOKUP(Suppliers[[#This Row],[支払条件コード]],PmtTerms[#All],2,0)","v":"月末〆４０日後払"},{"$f":"IFERROR(VLOOKUP(Suppliers[[#This Row],[支払条件コード]],PmtTerms[],3,0),\"\")","v":2},{"$f":"IFERROR(VLOOKUP(Suppliers[[#This Row],[支払条件コード]],PmtTerms[],4,0),\"\")","v":10}]
["-","KN-000060","中小企業退職金共済事業本部","中小企業退職金共済",{"$f":"LENB(Suppliers[[#This Row],[省略名称（半角18,全角9文字以下）]])","v":18},"11VK",{"$f":"VLOOKUP(Suppliers[[#This Row],[支払条件コード]],PmtTerms[#All],2,0)","v":"月末〆２０日後払"},{"$f":"IFERROR(VLOOKUP(Suppliers[[#This Row],[支払条件コード]],PmtTerms[],3,0),\"\")","v":1},{"$f":"IFERROR(VLOOKUP(Suppliers[[#This Row],[支払条件コード]],PmtTerms[],4,0),\"\")","v":20}]
["-","KN-000061","（株）内田洋行","内田洋行",{"$f":"LENB(Suppliers[[#This Row],[省略名称（半角18,全角9文字以下）]])","v":8},"11VV",{"$f":"VLOOKUP(Suppliers[[#This Row],[支払条件コード]],PmtTerms[#All],2,0)","v":"月末〆３０日後払"},{"$f":"IFERROR(VLOOKUP(Suppliers[[#This Row],[支払条件コード]],PmtTerms[],3,0),\"\")","v":2},{"$f":"IFERROR(VLOOKUP(Suppliers[[#This Row],[支払条件コード]],PmtTerms[],4,0),\"\")","v":0}]
["0000000000062","KN-000062","ユアサ・フナショク㈱","ユアサ・フナショク",{"$f":"LENB(Suppliers[[#This Row],[省略名称（半角18,全角9文字以下）]])","v":18},"13VF",{"$f":"VLOOKUP(Suppliers[[#This Row],[支払条件コード]],PmtTerms[#All],2,0)","v":"月末〆７５日後払"},{"$f":"IFERROR(VLOOKUP(Suppliers[[#This Row],[支払条件コード]],PmtTerms[],3,0),\"\")","v":3},{"$f":"IFERROR(VLOOKUP(Suppliers[[#This Row],[支払条件コード]],PmtTerms[],4,0),\"\")","v":15}]
["-","KN-000063","高野税理士事務所","高野税理士事務所",{"$f":"LENB(Suppliers[[#This Row],[省略名称（半角18,全角9文字以下）]])","v":16},"11VV",{"$f":"VLOOKUP(Suppliers[[#This Row],[支払条件コード]],PmtTerms[#All],2,0)","v":"月末〆３０日後払"},{"$f":"IFERROR(VLOOKUP(Suppliers[[#This Row],[支払条件コード]],PmtTerms[],3,0),\"\")","v":2},{"$f":"IFERROR(VLOOKUP(Suppliers[[#This Row],[支払条件コード]],PmtTerms[],4,0),\"\")","v":0}]
["-","KN-000064","トヨタL&F神奈川（株）","トヨタL&F神奈川",{"$f":"LENB(Suppliers[[#This Row],[省略名称（半角18,全角9文字以下）]])","v":15},"11VV",{"$f":"VLOOKUP(Suppliers[[#This Row],[支払条件コード]],PmtTerms[#All],2,0)","v":"月末〆３０日後払"},{"$f":"IFERROR(VLOOKUP(Suppliers[[#This Row],[支払条件コード]],PmtTerms[],3,0),\"\")","v":2},{"$f":"IFERROR(VLOOKUP(Suppliers[[#This Row],[支払条件コード]],PmtTerms[],4,0),\"\")","v":0}]
["-","KN-000065","日新健康保険組合","日新健康保険組合",{"$f":"LENB(Suppliers[[#This Row],[省略名称（半角18,全角9文字以下）]])","v":16},"11VV",{"$f":"VLOOKUP(Suppliers[[#This Row],[支払条件コード]],PmtTerms[#All],2,0)","v":"月末〆３０日後払"},{"$f":"IFERROR(VLOOKUP(Suppliers[[#This Row],[支払条件コード]],PmtTerms[],3,0),\"\")","v":2},{"$f":"IFERROR(VLOOKUP(Suppliers[[#This Row],[支払条件コード]],PmtTerms[],4,0),\"\")","v":0}]
["-","KN-000066","日新社員持株会","日新社員持株会",{"$f":"LENB(Suppliers[[#This Row],[省略名称（半角18,全角9文字以下）]])","v":14},"0001",{"$f":"VLOOKUP(Suppliers[[#This Row],[支払条件コード]],PmtTerms[#All],2,0)","v":"計上後即時"},{"$f":"IFERROR(VLOOKUP(Suppliers[[#This Row],[支払条件コード]],PmtTerms[],3,0),\"\")","v":0},{"$f":"IFERROR(VLOOKUP(Suppliers[[#This Row],[支払条件コード]],PmtTerms[],4,0),\"\")","v":0}]
["-","KN-000067","日本年金機構","日本年金機構",{"$f":"LENB(Suppliers[[#This Row],[省略名称（半角18,全角9文字以下）]])","v":12},"11VV",{"$f":"VLOOKUP(Suppliers[[#This Row],[支払条件コード]],PmtTerms[#All],2,0)","v":"月末〆３０日後払"},{"$f":"IFERROR(VLOOKUP(Suppliers[[#This Row],[支払条件コード]],PmtTerms[],3,0),\"\")","v":2},{"$f":"IFERROR(VLOOKUP(Suppliers[[#This Row],[支払条件コード]],PmtTerms[],4,0),\"\")","v":0}]
["-","KN-000068","神奈川労働局","神奈川労働局",{"$f":"LENB(Suppliers[[#This Row],[省略名称（半角18,全角9文字以下）]])","v":12},"0001",{"$f":"VLOOKUP(Suppliers[[#This Row],[支払条件コード]],PmtTerms[#All],2,0)","v":"計上後即時"},{"$f":"IFERROR(VLOOKUP(Suppliers[[#This Row],[支払条件コード]],PmtTerms[],3,0),\"\")","v":0},{"$f":"IFERROR(VLOOKUP(Suppliers[[#This Row],[支払条件コード]],PmtTerms[],4,0),\"\")","v":0}]
["-","KN-000069","神奈川県小麦粉問屋懇意会","小麦粉問屋懇意会",{"$f":"LENB(Suppliers[[#This Row],[省略名称（半角18,全角9文字以下）]])","v":16},"11VV",{"$f":"VLOOKUP(Suppliers[[#This Row],[支払条件コード]],PmtTerms[#All],2,0)","v":"月末〆３０日後払"},{"$f":"IFERROR(VLOOKUP(Suppliers[[#This Row],[支払条件コード]],PmtTerms[],3,0),\"\")","v":2},{"$f":"IFERROR(VLOOKUP(Suppliers[[#This Row],[支払条件コード]],PmtTerms[],4,0),\"\")","v":0}]
["-","KN-000070","横浜市麺業協同組合","横浜市麺業協同組合",{"$f":"LENB(Suppliers[[#This Row],[省略名称（半角18,全角9文字以下）]])","v":18},"11VV",{"$f":"VLOOKUP(Suppliers[[#This Row],[支払条件コード]],PmtTerms[#All],2,0)","v":"月末〆３０日後払"},{"$f":"IFERROR(VLOOKUP(Suppliers[[#This Row],[支払条件コード]],PmtTerms[],3,0),\"\")","v":2},{"$f":"IFERROR(VLOOKUP(Suppliers[[#This Row],[支払条件コード]],PmtTerms[],4,0),\"\")","v":0}]
["-","KN-000071","花象わかしお会","花象わかしお会",{"$f":"LENB(Suppliers[[#This Row],[省略名称（半角18,全角9文字以下）]])","v":14},"11VV",{"$f":"VLOOKUP(Suppliers[[#This Row],[支払条件コード]],PmtTerms[#All],2,0)","v":"月末〆３０日後払"},{"$f":"IFERROR(VLOOKUP(Suppliers[[#This Row],[支払条件コード]],PmtTerms[],3,0),\"\")","v":2},{"$f":"IFERROR(VLOOKUP(Suppliers[[#This Row],[支払条件コード]],PmtTerms[],4,0),\"\")","v":0}]
["-","KN-000072","神奈川日粉会","神奈川日粉会",{"$f":"LENB(Suppliers[[#This Row],[省略名称（半角18,全角9文字以下）]])","v":12},"11VV",{"$f":"VLOOKUP(Suppliers[[#This Row],[支払条件コード]],PmtTerms[#All],2,0)","v":"月末〆３０日後払"},{"$f":"IFERROR(VLOOKUP(Suppliers[[#This Row],[支払条件コード]],PmtTerms[],3,0),\"\")","v":2},{"$f":"IFERROR(VLOOKUP(Suppliers[[#This Row],[支払条件コード]],PmtTerms[],4,0),\"\")","v":0}]
["-","KN-000073","神奈川県料理材料卸商協同組合","料理材料卸商協組",{"$f":"LENB(Suppliers[[#This Row],[省略名称（半角18,全角9文字以下）]])","v":16},"11VV",{"$f":"VLOOKUP(Suppliers[[#This Row],[支払条件コード]],PmtTerms[#All],2,0)","v":"月末〆３０日後払"},{"$f":"IFERROR(VLOOKUP(Suppliers[[#This Row],[支払条件コード]],PmtTerms[],3,0),\"\")","v":2},{"$f":"IFERROR(VLOOKUP(Suppliers[[#This Row],[支払条件コード]],PmtTerms[],4,0),\"\")","v":0}]
["-","KN-000074","榮村EFG会","榮村EFG会",{"$f":"LENB(Suppliers[[#This Row],[省略名称（半角18,全角9文字以下）]])","v":9},"11VV",{"$f":"VLOOKUP(Suppliers[[#This Row],[支払条件コード]],PmtTerms[#All],2,0)","v":"月末〆３０日後払"},{"$f":"IFERROR(VLOOKUP(Suppliers[[#This Row],[支払条件コード]],PmtTerms[],3,0),\"\")","v":2},{"$f":"IFERROR(VLOOKUP(Suppliers[[#This Row],[支払条件コード]],PmtTerms[],4,0),\"\")","v":0}]
["-","KN-000075","横浜総合アソシエイツ会","横浜アソシエイツ会",{"$f":"LENB(Suppliers[[#This Row],[省略名称（半角18,全角9文字以下）]])","v":18},"11VV",{"$f":"VLOOKUP(Suppliers[[#This Row],[支払条件コード]],PmtTerms[#All],2,0)","v":"月末〆３０日後払"},{"$f":"IFERROR(VLOOKUP(Suppliers[[#This Row],[支払条件コード]],PmtTerms[],3,0),\"\")","v":2},{"$f":"IFERROR(VLOOKUP(Suppliers[[#This Row],[支払条件コード]],PmtTerms[],4,0),\"\")","v":0}]
["-","KN-000076","神奈川県損害保険代理店業協会","損保代理店業協会",{"$f":"LENB(Suppliers[[#This Row],[省略名称（半角18,全角9文字以下）]])","v":16},"12VV",{"$f":"VLOOKUP(Suppliers[[#This Row],[支払条件コード]],PmtTerms[#All],2,0)","v":"月末〆６０日後払"},{"$f":"IFERROR(VLOOKUP(Suppliers[[#This Row],[支払条件コード]],PmtTerms[],3,0),\"\")","v":3},{"$f":"IFERROR(VLOOKUP(Suppliers[[#This Row],[支払条件コード]],PmtTerms[],4,0),\"\")","v":0}]
["-","KN-000077","横浜中法人会","横浜中法人会",{"$f":"LENB(Suppliers[[#This Row],[省略名称（半角18,全角9文字以下）]])","v":12},"12VV",{"$f":"VLOOKUP(Suppliers[[#This Row],[支払条件コード]],PmtTerms[#All],2,0)","v":"月末〆６０日後払"},{"$f":"IFERROR(VLOOKUP(Suppliers[[#This Row],[支払条件コード]],PmtTerms[],3,0),\"\")","v":3},{"$f":"IFERROR(VLOOKUP(Suppliers[[#This Row],[支払条件コード]],PmtTerms[],4,0),\"\")","v":0}]
["-","KN-000078","横浜商工会議所","横浜商工会議所",{"$f":"LENB(Suppliers[[#This Row],[省略名称（半角18,全角9文字以下）]])","v":14},"12VV",{"$f":"VLOOKUP(Suppliers[[#This Row],[支払条件コード]],PmtTerms[#All],2,0)","v":"月末〆６０日後払"},{"$f":"IFERROR(VLOOKUP(Suppliers[[#This Row],[支払条件コード]],PmtTerms[],3,0),\"\")","v":3},{"$f":"IFERROR(VLOOKUP(Suppliers[[#This Row],[支払条件コード]],PmtTerms[],4,0),\"\")","v":0}]
["-","KN-000079","神奈川県社会保険協会","県社会保険協会",{"$f":"LENB(Suppliers[[#This Row],[省略名称（半角18,全角9文字以下）]])","v":14},"12VV",{"$f":"VLOOKUP(Suppliers[[#This Row],[支払条件コード]],PmtTerms[#All],2,0)","v":"月末〆６０日後払"},{"$f":"IFERROR(VLOOKUP(Suppliers[[#This Row],[支払条件コード]],PmtTerms[],3,0),\"\")","v":3},{"$f":"IFERROR(VLOOKUP(Suppliers[[#This Row],[支払条件コード]],PmtTerms[],4,0),\"\")","v":0}]
["-","KN-000080","さくらインターネット株式会社","さくらｲﾝﾀｰﾈｯﾄ㈱",{"$f":"LENB(Suppliers[[#This Row],[省略名称（半角18,全角9文字以下）]])","v":15},"12VV",{"$f":"VLOOKUP(Suppliers[[#This Row],[支払条件コード]],PmtTerms[#All],2,0)","v":"月末〆６０日後払"},{"$f":"IFERROR(VLOOKUP(Suppliers[[#This Row],[支払条件コード]],PmtTerms[],3,0),\"\")","v":3},{"$f":"IFERROR(VLOOKUP(Suppliers[[#This Row],[支払条件コード]],PmtTerms[],4,0),\"\")","v":0}]
["0000000000081","KN-000081","隅田商事㈱","隅田商事",{"$f":"LENB(Suppliers[[#This Row],[省略名称（半角18,全角9文字以下）]])","v":8},"11VV",{"$f":"VLOOKUP(Suppliers[[#This Row],[支払条件コード]],PmtTerms[#All],2,0)","v":"月末〆３０日後払"},{"$f":"IFERROR(VLOOKUP(Suppliers[[#This Row],[支払条件コード]],PmtTerms[],3,0),\"\")","v":2},{"$f":"IFERROR(VLOOKUP(Suppliers[[#This Row],[支払条件コード]],PmtTerms[],4,0),\"\")","v":0}]
["-","KN-000082","勤次郎株式会社","勤次郎株式会社",{"$f":"LENB(Suppliers[[#This Row],[省略名称（半角18,全角9文字以下）]])","v":14},"12VV",{"$f":"VLOOKUP(Suppliers[[#This Row],[支払条件コード]],PmtTerms[#All],2,0)","v":"月末〆６０日後払"},{"$f":"IFERROR(VLOOKUP(Suppliers[[#This Row],[支払条件コード]],PmtTerms[],3,0),\"\")","v":3},{"$f":"IFERROR(VLOOKUP(Suppliers[[#This Row],[支払条件コード]],PmtTerms[],4,0),\"\")","v":0}]
["-","KN-000083","株式会社NTTデータ","株式会社NTTデータ",{"$f":"LENB(Suppliers[[#This Row],[省略名称（半角18,全角9文字以下）]])","v":17},"10FV",{"$f":"VLOOKUP(Suppliers[[#This Row],[支払条件コード]],PmtTerms[#All],2,0)","v":"１５日〆１５日後払"},{"$f":"IFERROR(VLOOKUP(Suppliers[[#This Row],[支払条件コード]],PmtTerms[],3,0),\"\")","v":1},{"$f":"IFERROR(VLOOKUP(Suppliers[[#This Row],[支払条件コード]],PmtTerms[],4,0),\"\")","v":0}]
["-","KN-000084","株式会社エイコー","株式会社エイコー",{"$f":"LENB(Suppliers[[#This Row],[省略名称（半角18,全角9文字以下）]])","v":16},"11VV",{"$f":"VLOOKUP(Suppliers[[#This Row],[支払条件コード]],PmtTerms[#All],2,0)","v":"月末〆３０日後払"},{"$f":"IFERROR(VLOOKUP(Suppliers[[#This Row],[支払条件コード]],PmtTerms[],3,0),\"\")","v":2},{"$f":"IFERROR(VLOOKUP(Suppliers[[#This Row],[支払条件コード]],PmtTerms[],4,0),\"\")","v":0}]
["-","KN-000085","株式会社映像企画センター","㈱映像企画センター",{"$f":"LENB(Suppliers[[#This Row],[省略名称（半角18,全角9文字以下）]])","v":18},"11VV",{"$f":"VLOOKUP(Suppliers[[#This Row],[支払条件コード]],PmtTerms[#All],2,0)","v":"月末〆３０日後払"},{"$f":"IFERROR(VLOOKUP(Suppliers[[#This Row],[支払条件コード]],PmtTerms[],3,0),\"\")","v":2},{"$f":"IFERROR(VLOOKUP(Suppliers[[#This Row],[支払条件コード]],PmtTerms[],4,0),\"\")","v":0}]
["-","KN-000086","日本郵便株式会社","日本郵便株式会社",{"$f":"LENB(Suppliers[[#This Row],[省略名称（半角18,全角9文字以下）]])","v":16},"11VK",{"$f":"VLOOKUP(Suppliers[[#This Row],[支払条件コード]],PmtTerms[#All],2,0)","v":"月末〆２０日後払"},{"$f":"IFERROR(VLOOKUP(Suppliers[[#This Row],[支払条件コード]],PmtTerms[],3,0),\"\")","v":1},{"$f":"IFERROR(VLOOKUP(Suppliers[[#This Row],[支払条件コード]],PmtTerms[],4,0),\"\")","v":20}]
["-","KN-000087","アフラック生命保険株式会社","アフラック生命保険",{"$f":"LENB(Suppliers[[#This Row],[省略名称（半角18,全角9文字以下）]])","v":18},"10FP",{"$f":"VLOOKUP(Suppliers[[#This Row],[支払条件コード]],PmtTerms[#All],2,0)","v":"１５日〆１０日後払"},{"$f":"IFERROR(VLOOKUP(Suppliers[[#This Row],[支払条件コード]],PmtTerms[],3,0),\"\")","v":0},{"$f":"IFERROR(VLOOKUP(Suppliers[[#This Row],[支払条件コード]],PmtTerms[],4,0),\"\")","v":25}]
["-","KN-000088","住友生命保険株式会社","住友生命保険㈱",{"$f":"LENB(Suppliers[[#This Row],[省略名称（半角18,全角9文字以下）]])","v":14},"10FP",{"$f":"VLOOKUP(Suppliers[[#This Row],[支払条件コード]],PmtTerms[#All],2,0)","v":"１５日〆１０日後払"},{"$f":"IFERROR(VLOOKUP(Suppliers[[#This Row],[支払条件コード]],PmtTerms[],3,0),\"\")","v":0},{"$f":"IFERROR(VLOOKUP(Suppliers[[#This Row],[支払条件コード]],PmtTerms[],4,0),\"\")","v":25}]
["-","KN-000089","大樹生命株式会社","大樹生命株式会社",{"$f":"LENB(Suppliers[[#This Row],[省略名称（半角18,全角9文字以下）]])","v":16},"10FP",{"$f":"VLOOKUP(Suppliers[[#This Row],[支払条件コード]],PmtTerms[#All],2,0)","v":"１５日〆１０日後払"},{"$f":"IFERROR(VLOOKUP(Suppliers[[#This Row],[支払条件コード]],PmtTerms[],3,0),\"\")","v":0},{"$f":"IFERROR(VLOOKUP(Suppliers[[#This Row],[支払条件コード]],PmtTerms[],4,0),\"\")","v":25}]
["-","KN-000090","第一生命保険株式会社","第一生命保険㈱",{"$f":"LENB(Suppliers[[#This Row],[省略名称（半角18,全角9文字以下）]])","v":14},"10FP",{"$f":"VLOOKUP(Suppliers[[#This Row],[支払条件コード]],PmtTerms[#All],2,0)","v":"１５日〆１０日後払"},{"$f":"IFERROR(VLOOKUP(Suppliers[[#This Row],[支払条件コード]],PmtTerms[],3,0),\"\")","v":0},{"$f":"IFERROR(VLOOKUP(Suppliers[[#This Row],[支払条件コード]],PmtTerms[],4,0),\"\")","v":25}]
["-","KN-000091","日本生命保険相互会社","日本生命保険",{"$f":"LENB(Suppliers[[#This Row],[省略名称（半角18,全角9文字以下）]])","v":12},"10FP",{"$f":"VLOOKUP(Suppliers[[#This Row],[支払条件コード]],PmtTerms[#All],2,0)","v":"１５日〆１０日後払"},{"$f":"IFERROR(VLOOKUP(Suppliers[[#This Row],[支払条件コード]],PmtTerms[],3,0),\"\")","v":0},{"$f":"IFERROR(VLOOKUP(Suppliers[[#This Row],[支払条件コード]],PmtTerms[],4,0),\"\")","v":25}]
["-","KN-000092","明治安田生命保険相互会社","明治安田生命保険",{"$f":"LENB(Suppliers[[#This Row],[省略名称（半角18,全角9文字以下）]])","v":16},"10FP",{"$f":"VLOOKUP(Suppliers[[#This Row],[支払条件コード]],PmtTerms[#All],2,0)","v":"１５日〆１０日後払"},{"$f":"IFERROR(VLOOKUP(Suppliers[[#This Row],[支払条件コード]],PmtTerms[],3,0),\"\")","v":0},{"$f":"IFERROR(VLOOKUP(Suppliers[[#This Row],[支払条件コード]],PmtTerms[],4,0),\"\")","v":25}]
["-","KN-000093","株式会社ホンダカーズ横浜","㈱ホンダカーズ横浜",{"$f":"LENB(Suppliers[[#This Row],[省略名称（半角18,全角9文字以下）]])","v":18},"10FV",{"$f":"VLOOKUP(Suppliers[[#This Row],[支払条件コード]],PmtTerms[#All],2,0)","v":"１５日〆１５日後払"},{"$f":"IFERROR(VLOOKUP(Suppliers[[#This Row],[支払条件コード]],PmtTerms[],3,0),\"\")","v":1},{"$f":"IFERROR(VLOOKUP(Suppliers[[#This Row],[支払条件コード]],PmtTerms[],4,0),\"\")","v":0}]
["-","KN-000094","株式会社ダイトーフジテック","ダイトーフジテック",{"$f":"LENB(Suppliers[[#This Row],[省略名称（半角18,全角9文字以下）]])","v":18},"11VV",{"$f":"VLOOKUP(Suppliers[[#This Row],[支払条件コード]],PmtTerms[#All],2,0)","v":"月末〆３０日後払"},{"$f":"IFERROR(VLOOKUP(Suppliers[[#This Row],[支払条件コード]],PmtTerms[],3,0),\"\")","v":2},{"$f":"IFERROR(VLOOKUP(Suppliers[[#This Row],[支払条件コード]],PmtTerms[],4,0),\"\")","v":0}]
["-","KN-000095","湘南製麺協同組合","湘南製麺協同組合",{"$f":"LENB(Suppliers[[#This Row],[省略名称（半角18,全角9文字以下）]])","v":16},"11VV",{"$f":"VLOOKUP(Suppliers[[#This Row],[支払条件コード]],PmtTerms[#All],2,0)","v":"月末〆３０日後払"},{"$f":"IFERROR(VLOOKUP(Suppliers[[#This Row],[支払条件コード]],PmtTerms[],3,0),\"\")","v":2},{"$f":"IFERROR(VLOOKUP(Suppliers[[#This Row],[支払条件コード]],PmtTerms[],4,0),\"\")","v":0}]
["-","KN-000096","南関東日野自動車株式会社","南関東日野自動車㈱",{"$f":"LENB(Suppliers[[#This Row],[省略名称（半角18,全角9文字以下）]])","v":18},"11VV",{"$f":"VLOOKUP(Suppliers[[#This Row],[支払条件コード]],PmtTerms[#All],2,0)","v":"月末〆３０日後払"},{"$f":"IFERROR(VLOOKUP(Suppliers[[#This Row],[支払条件コード]],PmtTerms[],3,0),\"\")","v":2},{"$f":"IFERROR(VLOOKUP(Suppliers[[#This Row],[支払条件コード]],PmtTerms[],4,0),\"\")","v":0}]
["-","KN-000097","結核予防会神奈川県","結核予防会神奈川県",{"$f":"LENB(Suppliers[[#This Row],[省略名称（半角18,全角9文字以下）]])","v":18},"11VV",{"$f":"VLOOKUP(Suppliers[[#This Row],[支払条件コード]],PmtTerms[#All],2,0)","v":"月末〆３０日後払"},{"$f":"IFERROR(VLOOKUP(Suppliers[[#This Row],[支払条件コード]],PmtTerms[],3,0),\"\")","v":2},{"$f":"IFERROR(VLOOKUP(Suppliers[[#This Row],[支払条件コード]],PmtTerms[],4,0),\"\")","v":0}]
["-","KN-000098","日新航空サービス株式会社","日新航空サービス㈱",{"$f":"LENB(Suppliers[[#This Row],[省略名称（半角18,全角9文字以下）]])","v":18},"11VV",{"$f":"VLOOKUP(Suppliers[[#This Row],[支払条件コード]],PmtTerms[#All],2,0)","v":"月末〆３０日後払"},{"$f":"IFERROR(VLOOKUP(Suppliers[[#This Row],[支払条件コード]],PmtTerms[],3,0),\"\")","v":2},{"$f":"IFERROR(VLOOKUP(Suppliers[[#This Row],[支払条件コード]],PmtTerms[],4,0),\"\")","v":0}]
["-","KN-000099","佐久島弁財天奉賛会","佐久島弁財天奉賛会",{"$f":"LENB(Suppliers[[#This Row],[省略名称（半角18,全角9文字以下）]])","v":18},"10FV",{"$f":"VLOOKUP(Suppliers[[#This Row],[支払条件コード]],PmtTerms[#All],2,0)","v":"１５日〆１５日後払"},{"$f":"IFERROR(VLOOKUP(Suppliers[[#This Row],[支払条件コード]],PmtTerms[],3,0),\"\")","v":1},{"$f":"IFERROR(VLOOKUP(Suppliers[[#This Row],[支払条件コード]],PmtTerms[],4,0),\"\")","v":0}]
["0000000000123","KN-000123","三菱商事㈱ （はくばく・粉）","三菱商事(はくばく)",{"$f":"LENB(Suppliers[[#This Row],[省略名称（半角18,全角9文字以下）]])","v":18},"11VV",{"$f":"VLOOKUP(Suppliers[[#This Row],[支払条件コード]],PmtTerms[#All],2,0)","v":"月末〆３０日後払"},{"$f":"IFERROR(VLOOKUP(Suppliers[[#This Row],[支払条件コード]],PmtTerms[],3,0),\"\")","v":2},{"$f":"IFERROR(VLOOKUP(Suppliers[[#This Row],[支払条件コード]],PmtTerms[],4,0),\"\")","v":0}]
["0000000000130","KN-000130","ヤマト食品㈱東京営業所","ヤマト食品",{"$f":"LENB(Suppliers[[#This Row],[省略名称（半角18,全角9文字以下）]])","v":10},"11VV",{"$f":"VLOOKUP(Suppliers[[#This Row],[支払条件コード]],PmtTerms[#All],2,0)","v":"月末〆３０日後払"},{"$f":"IFERROR(VLOOKUP(Suppliers[[#This Row],[支払条件コード]],PmtTerms[],3,0),\"\")","v":2},{"$f":"IFERROR(VLOOKUP(Suppliers[[#This Row],[支払条件コード]],PmtTerms[],4,0),\"\")","v":0}]
["0000000000141","KN-000141","㈱蜜元研究所","蜜元研究所",{"$f":"LENB(Suppliers[[#This Row],[省略名称（半角18,全角9文字以下）]])","v":10},"11VV",{"$f":"VLOOKUP(Suppliers[[#This Row],[支払条件コード]],PmtTerms[#All],2,0)","v":"月末〆３０日後払"},{"$f":"IFERROR(VLOOKUP(Suppliers[[#This Row],[支払条件コード]],PmtTerms[],3,0),\"\")","v":2},{"$f":"IFERROR(VLOOKUP(Suppliers[[#This Row],[支払条件コード]],PmtTerms[],4,0),\"\")","v":0}]
["0000000000154","KN-000154","三菱商事㈱（鳥越製粉）","三菱商事(鳥越製粉)",{"$f":"LENB(Suppliers[[#This Row],[省略名称（半角18,全角9文字以下）]])","v":18},"11VV",{"$f":"VLOOKUP(Suppliers[[#This Row],[支払条件コード]],PmtTerms[#All],2,0)","v":"月末〆３０日後払"},{"$f":"IFERROR(VLOOKUP(Suppliers[[#This Row],[支払条件コード]],PmtTerms[],3,0),\"\")","v":2},{"$f":"IFERROR(VLOOKUP(Suppliers[[#This Row],[支払条件コード]],PmtTerms[],4,0),\"\")","v":0}]
["0000000000215","KN-000215","㈱ニップン商事コ－ポレ－ション","ニップン商事",{"$f":"LENB(Suppliers[[#This Row],[省略名称（半角18,全角9文字以下）]])","v":12},"11VV",{"$f":"VLOOKUP(Suppliers[[#This Row],[支払条件コード]],PmtTerms[#All],2,0)","v":"月末〆３０日後払"},{"$f":"IFERROR(VLOOKUP(Suppliers[[#This Row],[支払条件コード]],PmtTerms[],3,0),\"\")","v":2},{"$f":"IFERROR(VLOOKUP(Suppliers[[#This Row],[支払条件コード]],PmtTerms[],4,0),\"\")","v":0}]
["0000000000222","KN-000222","千葉製粉㈱","千葉製粉",{"$f":"LENB(Suppliers[[#This Row],[省略名称（半角18,全角9文字以下）]])","v":8},"12VK",{"$f":"VLOOKUP(Suppliers[[#This Row],[支払条件コード]],PmtTerms[#All],2,0)","v":"月末〆５０日後払"},{"$f":"IFERROR(VLOOKUP(Suppliers[[#This Row],[支払条件コード]],PmtTerms[],3,0),\"\")","v":2},{"$f":"IFERROR(VLOOKUP(Suppliers[[#This Row],[支払条件コード]],PmtTerms[],4,0),\"\")","v":20}]
["0000000000253","KN-000253","三菱商事ﾗｲﾌｻｲｴﾝｽ㈱","三菱商事ﾗｲﾌｻｲｴﾝｽ",{"$f":"LENB(Suppliers[[#This Row],[省略名称（半角18,全角9文字以下）]])","v":16},"12VV",{"$f":"VLOOKUP(Suppliers[[#This Row],[支払条件コード]],PmtTerms[#All],2,0)","v":"月末〆６０日後払"},{"$f":"IFERROR(VLOOKUP(Suppliers[[#This Row],[支払条件コード]],PmtTerms[],3,0),\"\")","v":3},{"$f":"IFERROR(VLOOKUP(Suppliers[[#This Row],[支払条件コード]],PmtTerms[],4,0),\"\")","v":0}]
["0000000000270","KN-000270","かちどき製粉㈱","かちどき製粉",{"$f":"LENB(Suppliers[[#This Row],[省略名称（半角18,全角9文字以下）]])","v":12},"11VV",{"$f":"VLOOKUP(Suppliers[[#This Row],[支払条件コード]],PmtTerms[#All],2,0)","v":"月末〆３０日後払"},{"$f":"IFERROR(VLOOKUP(Suppliers[[#This Row],[支払条件コード]],PmtTerms[],3,0),\"\")","v":2},{"$f":"IFERROR(VLOOKUP(Suppliers[[#This Row],[支払条件コード]],PmtTerms[],4,0),\"\")","v":0}]
["0000000000280","KN-000280","ﾔﾏｼﾞｮｳ商事㈱","ﾔﾏｼﾞｮｳ商事",{"$f":"LENB(Suppliers[[#This Row],[省略名称（半角18,全角9文字以下）]])","v":10},"11VV",{"$f":"VLOOKUP(Suppliers[[#This Row],[支払条件コード]],PmtTerms[#All],2,0)","v":"月末〆３０日後払"},{"$f":"IFERROR(VLOOKUP(Suppliers[[#This Row],[支払条件コード]],PmtTerms[],3,0),\"\")","v":2},{"$f":"IFERROR(VLOOKUP(Suppliers[[#This Row],[支払条件コード]],PmtTerms[],4,0),\"\")","v":0}]
["0000000000351","KN-000351","杉山商事㈱","杉山商事",{"$f":"LENB(Suppliers[[#This Row],[省略名称（半角18,全角9文字以下）]])","v":8},"11VV",{"$f":"VLOOKUP(Suppliers[[#This Row],[支払条件コード]],PmtTerms[#All],2,0)","v":"月末〆３０日後払"},{"$f":"IFERROR(VLOOKUP(Suppliers[[#This Row],[支払条件コード]],PmtTerms[],3,0),\"\")","v":2},{"$f":"IFERROR(VLOOKUP(Suppliers[[#This Row],[支払条件コード]],PmtTerms[],4,0),\"\")","v":0}]
[null,"KN-000400","横浜市神奈川区役所","横浜市神奈川区役所",{"$f":"LENB(Suppliers[[#This Row],[省略名称（半角18,全角9文字以下）]])","v":18},"11AA",{"$f":"VLOOKUP(Suppliers[[#This Row],[支払条件コード]],PmtTerms[#All],2,0)","v":"１０日〆３０日後払"},{"$f":"IFERROR(VLOOKUP(Suppliers[[#This Row],[支払条件コード]],PmtTerms[],3,0),\"\")","v":1},{"$f":"IFERROR(VLOOKUP(Suppliers[[#This Row],[支払条件コード]],PmtTerms[],4,0),\"\")","v":10}]
[null,"KN-000401","ヤマト運輸　株式会社","ヤマト運輸株式会社",{"$f":"LENB(Suppliers[[#This Row],[省略名称（半角18,全角9文字以下）]])","v":18},"11VQ",{"$f":"VLOOKUP(Suppliers[[#This Row],[支払条件コード]],PmtTerms[#All],2,0)","v":"月末〆２６日後払"},{"$f":"IFERROR(VLOOKUP(Suppliers[[#This Row],[支払条件コード]],PmtTerms[],3,0),\"\")","v":1},{"$f":"IFERROR(VLOOKUP(Suppliers[[#This Row],[支払条件コード]],PmtTerms[],4,0),\"\")","v":26}]
[null,"KN-000402","株式会社　麻生","株式会社　麻生",{"$f":"LENB(Suppliers[[#This Row],[省略名称（半角18,全角9文字以下）]])","v":14},"11VV",{"$f":"VLOOKUP(Suppliers[[#This Row],[支払条件コード]],PmtTerms[#All],2,0)","v":"月末〆３０日後払"},{"$f":"IFERROR(VLOOKUP(Suppliers[[#This Row],[支払条件コード]],PmtTerms[],3,0),\"\")","v":2},{"$f":"IFERROR(VLOOKUP(Suppliers[[#This Row],[支払条件コード]],PmtTerms[],4,0),\"\")","v":0}]
["0000000001010","KN-001010","三井物産㈱　サンヨ－食品製品","三井物産(サンヨ－)",{"$f":"LENB(Suppliers[[#This Row],[省略名称（半角18,全角9文字以下）]])","v":18},"12VV",{"$f":"VLOOKUP(Suppliers[[#This Row],[支払条件コード]],PmtTerms[#All],2,0)","v":"月末〆６０日後払"},{"$f":"IFERROR(VLOOKUP(Suppliers[[#This Row],[支払条件コード]],PmtTerms[],3,0),\"\")","v":3},{"$f":"IFERROR(VLOOKUP(Suppliers[[#This Row],[支払条件コード]],PmtTerms[],4,0),\"\")","v":0}]
["0000000001027","KN-001027","明星食品㈱","明星食品",{"$f":"LENB(Suppliers[[#This Row],[省略名称（半角18,全角9文字以下）]])","v":8},"12VF",{"$f":"VLOOKUP(Suppliers[[#This Row],[支払条件コード]],PmtTerms[#All],2,0)","v":"月末〆４５日後払"},{"$f":"IFERROR(VLOOKUP(Suppliers[[#This Row],[支払条件コード]],PmtTerms[],3,0),\"\")","v":2},{"$f":"IFERROR(VLOOKUP(Suppliers[[#This Row],[支払条件コード]],PmtTerms[],4,0),\"\")","v":15}]
["0000000001034","KN-001034","東洋水産㈱","東洋水産",{"$f":"LENB(Suppliers[[#This Row],[省略名称（半角18,全角9文字以下）]])","v":8},"12VV",{"$f":"VLOOKUP(Suppliers[[#This Row],[支払条件コード]],PmtTerms[#All],2,0)","v":"月末〆６０日後払"},{"$f":"IFERROR(VLOOKUP(Suppliers[[#This Row],[支払条件コード]],PmtTerms[],3,0),\"\")","v":3},{"$f":"IFERROR(VLOOKUP(Suppliers[[#This Row],[支払条件コード]],PmtTerms[],4,0),\"\")","v":0}]
["0000000001081","KN-001081","赤城食品㈱","赤城食品",{"$f":"LENB(Suppliers[[#This Row],[省略名称（半角18,全角9文字以下）]])","v":8},"11VV",{"$f":"VLOOKUP(Suppliers[[#This Row],[支払条件コード]],PmtTerms[#All],2,0)","v":"月末〆３０日後払"},{"$f":"IFERROR(VLOOKUP(Suppliers[[#This Row],[支払条件コード]],PmtTerms[],3,0),\"\")","v":2},{"$f":"IFERROR(VLOOKUP(Suppliers[[#This Row],[支払条件コード]],PmtTerms[],4,0),\"\")","v":0}]
["0000000001111","KN-001111","㈱長谷川商店","長谷川商店",{"$f":"LENB(Suppliers[[#This Row],[省略名称（半角18,全角9文字以下）]])","v":10},"11VV",{"$f":"VLOOKUP(Suppliers[[#This Row],[支払条件コード]],PmtTerms[#All],2,0)","v":"月末〆３０日後払"},{"$f":"IFERROR(VLOOKUP(Suppliers[[#This Row],[支払条件コード]],PmtTerms[],3,0),\"\")","v":2},{"$f":"IFERROR(VLOOKUP(Suppliers[[#This Row],[支払条件コード]],PmtTerms[],4,0),\"\")","v":0}]
["0000000001131","KN-001131","コ－ビオンジャパン㈱","コ－ビオンジャパン",{"$f":"LENB(Suppliers[[#This Row],[省略名称（半角18,全角9文字以下）]])","v":18},"12VV",{"$f":"VLOOKUP(Suppliers[[#This Row],[支払条件コード]],PmtTerms[#All],2,0)","v":"月末〆６０日後払"},{"$f":"IFERROR(VLOOKUP(Suppliers[[#This Row],[支払条件コード]],PmtTerms[],3,0),\"\")","v":3},{"$f":"IFERROR(VLOOKUP(Suppliers[[#This Row],[支払条件コード]],PmtTerms[],4,0),\"\")","v":0}]
["0000000001155","KN-001155","東海デキストリン株式会社","東海デキストリン",{"$f":"LENB(Suppliers[[#This Row],[省略名称（半角18,全角9文字以下）]])","v":16},"11VV",{"$f":"VLOOKUP(Suppliers[[#This Row],[支払条件コード]],PmtTerms[#All],2,0)","v":"月末〆３０日後払"},{"$f":"IFERROR(VLOOKUP(Suppliers[[#This Row],[支払条件コード]],PmtTerms[],3,0),\"\")","v":2},{"$f":"IFERROR(VLOOKUP(Suppliers[[#This Row],[支払条件コード]],PmtTerms[],4,0),\"\")","v":0}]
["0000000001161","KN-001161","小堺化学工業㈱","小堺化学工業",{"$f":"LENB(Suppliers[[#This Row],[省略名称（半角18,全角9文字以下）]])","v":12},"12VV",{"$f":"VLOOKUP(Suppliers[[#This Row],[支払条件コード]],PmtTerms[#All],2,0)","v":"月末〆６０日後払"},{"$f":"IFERROR(VLOOKUP(Suppliers[[#This Row],[支払条件コード]],PmtTerms[],3,0),\"\")","v":3},{"$f":"IFERROR(VLOOKUP(Suppliers[[#This Row],[支払条件コード]],PmtTerms[],4,0),\"\")","v":0}]
["0000000001171","KN-001171","理研ビタミン㈱","理研ビタミン",{"$f":"LENB(Suppliers[[#This Row],[省略名称（半角18,全角9文字以下）]])","v":12},"12VV",{"$f":"VLOOKUP(Suppliers[[#This Row],[支払条件コード]],PmtTerms[#All],2,0)","v":"月末〆６０日後払"},{"$f":"IFERROR(VLOOKUP(Suppliers[[#This Row],[支払条件コード]],PmtTerms[],3,0),\"\")","v":3},{"$f":"IFERROR(VLOOKUP(Suppliers[[#This Row],[支払条件コード]],PmtTerms[],4,0),\"\")","v":0}]
["0000000001188","KN-001188","㈲太洋食化学","太洋食化学",{"$f":"LENB(Suppliers[[#This Row],[省略名称（半角18,全角9文字以下）]])","v":10},"12VV",{"$f":"VLOOKUP(Suppliers[[#This Row],[支払条件コード]],PmtTerms[#All],2,0)","v":"月末〆６０日後払"},{"$f":"IFERROR(VLOOKUP(Suppliers[[#This Row],[支払条件コード]],PmtTerms[],3,0),\"\")","v":3},{"$f":"IFERROR(VLOOKUP(Suppliers[[#This Row],[支払条件コード]],PmtTerms[],4,0),\"\")","v":0}]
["0000000001195","KN-001195","ＡＤＥＫＡケミカルサプライ㈱","ADEKAｹﾐｶﾙｻﾌﾟﾗｲ",{"$f":"LENB(Suppliers[[#This Row],[省略名称（半角18,全角9文字以下）]])","v":14},"12VV",{"$f":"VLOOKUP(Suppliers[[#This Row],[支払条件コード]],PmtTerms[#All],2,0)","v":"月末〆６０日後払"},{"$f":"IFERROR(VLOOKUP(Suppliers[[#This Row],[支払条件コード]],PmtTerms[],3,0),\"\")","v":3},{"$f":"IFERROR(VLOOKUP(Suppliers[[#This Row],[支払条件コード]],PmtTerms[],4,0),\"\")","v":0}]
["0000000001218","KN-001218","チヨダ㈱","チヨダ",{"$f":"LENB(Suppliers[[#This Row],[省略名称（半角18,全角9文字以下）]])","v":6},"11VV",{"$f":"VLOOKUP(Suppliers[[#This Row],[支払条件コード]],PmtTerms[#All],2,0)","v":"月末〆３０日後払"},{"$f":"IFERROR(VLOOKUP(Suppliers[[#This Row],[支払条件コード]],PmtTerms[],3,0),\"\")","v":2},{"$f":"IFERROR(VLOOKUP(Suppliers[[#This Row],[支払条件コード]],PmtTerms[],4,0),\"\")","v":0}]
["0000000001232","KN-001232","真田物産㈱","真田物産",{"$f":"LENB(Suppliers[[#This Row],[省略名称（半角18,全角9文字以下）]])","v":8},"12VV",{"$f":"VLOOKUP(Suppliers[[#This Row],[支払条件コード]],PmtTerms[#All],2,0)","v":"月末〆６０日後払"},{"$f":"IFERROR(VLOOKUP(Suppliers[[#This Row],[支払条件コード]],PmtTerms[],3,0),\"\")","v":3},{"$f":"IFERROR(VLOOKUP(Suppliers[[#This Row],[支払条件コード]],PmtTerms[],4,0),\"\")","v":0}]
["0000000001256","KN-001256","㈱みうら食品","みうら食品",{"$f":"LENB(Suppliers[[#This Row],[省略名称（半角18,全角9文字以下）]])","v":10},"12VV",{"$f":"VLOOKUP(Suppliers[[#This Row],[支払条件コード]],PmtTerms[#All],2,0)","v":"月末〆６０日後払"},{"$f":"IFERROR(VLOOKUP(Suppliers[[#This Row],[支払条件コード]],PmtTerms[],3,0),\"\")","v":3},{"$f":"IFERROR(VLOOKUP(Suppliers[[#This Row],[支払条件コード]],PmtTerms[],4,0),\"\")","v":0}]
["0000000001273","KN-001273","㈱マコト","マコト",{"$f":"LENB(Suppliers[[#This Row],[省略名称（半角18,全角9文字以下）]])","v":6},"11VV",{"$f":"VLOOKUP(Suppliers[[#This Row],[支払条件コード]],PmtTerms[#All],2,0)","v":"月末〆３０日後払"},{"$f":"IFERROR(VLOOKUP(Suppliers[[#This Row],[支払条件コード]],PmtTerms[],3,0),\"\")","v":2},{"$f":"IFERROR(VLOOKUP(Suppliers[[#This Row],[支払条件コード]],PmtTerms[],4,0),\"\")","v":0}]
["0000000001294","KN-001294","日本コロイド㈱","日本コロイド",{"$f":"LENB(Suppliers[[#This Row],[省略名称（半角18,全角9文字以下）]])","v":12},"12VV",{"$f":"VLOOKUP(Suppliers[[#This Row],[支払条件コード]],PmtTerms[#All],2,0)","v":"月末〆６０日後払"},{"$f":"IFERROR(VLOOKUP(Suppliers[[#This Row],[支払条件コード]],PmtTerms[],3,0),\"\")","v":3},{"$f":"IFERROR(VLOOKUP(Suppliers[[#This Row],[支払条件コード]],PmtTerms[],4,0),\"\")","v":0}]
["0000000001300","KN-001300","交易食品㈱","交易食品",{"$f":"LENB(Suppliers[[#This Row],[省略名称（半角18,全角9文字以下）]])","v":8},"12VV",{"$f":"VLOOKUP(Suppliers[[#This Row],[支払条件コード]],PmtTerms[#All],2,0)","v":"月末〆６０日後払"},{"$f":"IFERROR(VLOOKUP(Suppliers[[#This Row],[支払条件コード]],PmtTerms[],3,0),\"\")","v":3},{"$f":"IFERROR(VLOOKUP(Suppliers[[#This Row],[支払条件コード]],PmtTerms[],4,0),\"\")","v":0}]
["0000000001348","KN-001348","山印醸造㈱","山印醸造",{"$f":"LENB(Suppliers[[#This Row],[省略名称（半角18,全角9文字以下）]])","v":8},"12VV",{"$f":"VLOOKUP(Suppliers[[#This Row],[支払条件コード]],PmtTerms[#All],2,0)","v":"月末〆６０日後払"},{"$f":"IFERROR(VLOOKUP(Suppliers[[#This Row],[支払条件コード]],PmtTerms[],3,0),\"\")","v":3},{"$f":"IFERROR(VLOOKUP(Suppliers[[#This Row],[支払条件コード]],PmtTerms[],4,0),\"\")","v":0}]
["0000000001355","KN-001355","三井物産㈱　オ－マイ製品","三井物産(オ－マイ)",{"$f":"LENB(Suppliers[[#This Row],[省略名称（半角18,全角9文字以下）]])","v":18},"12VV",{"$f":"VLOOKUP(Suppliers[[#This Row],[支払条件コード]],PmtTerms[#All],2,0)","v":"月末〆６０日後払"},{"$f":"IFERROR(VLOOKUP(Suppliers[[#This Row],[支払条件コード]],PmtTerms[],3,0),\"\")","v":3},{"$f":"IFERROR(VLOOKUP(Suppliers[[#This Row],[支払条件コード]],PmtTerms[],4,0),\"\")","v":0}]
["0000000001393","KN-001393","東洋水産㈱冷食","東洋水産(冷食)",{"$f":"LENB(Suppliers[[#This Row],[省略名称（半角18,全角9文字以下）]])","v":14},"12VV",{"$f":"VLOOKUP(Suppliers[[#This Row],[支払条件コード]],PmtTerms[#All],2,0)","v":"月末〆６０日後払"},{"$f":"IFERROR(VLOOKUP(Suppliers[[#This Row],[支払条件コード]],PmtTerms[],3,0),\"\")","v":3},{"$f":"IFERROR(VLOOKUP(Suppliers[[#This Row],[支払条件コード]],PmtTerms[],4,0),\"\")","v":0}]
["0000000001411","KN-001411","株式会社協和洋行","協和洋行",{"$f":"LENB(Suppliers[[#This Row],[省略名称（半角18,全角9文字以下）]])","v":8},"11VV",{"$f":"VLOOKUP(Suppliers[[#This Row],[支払条件コード]],PmtTerms[#All],2,0)","v":"月末〆３０日後払"},{"$f":"IFERROR(VLOOKUP(Suppliers[[#This Row],[支払条件コード]],PmtTerms[],3,0),\"\")","v":2},{"$f":"IFERROR(VLOOKUP(Suppliers[[#This Row],[支払条件コード]],PmtTerms[],4,0),\"\")","v":0}]
["0000000001423","KN-001423","カネク株式会社","カネク",{"$f":"LENB(Suppliers[[#This Row],[省略名称（半角18,全角9文字以下）]])","v":6},"12VV",{"$f":"VLOOKUP(Suppliers[[#This Row],[支払条件コード]],PmtTerms[#All],2,0)","v":"月末〆６０日後払"},{"$f":"IFERROR(VLOOKUP(Suppliers[[#This Row],[支払条件コード]],PmtTerms[],3,0),\"\")","v":3},{"$f":"IFERROR(VLOOKUP(Suppliers[[#This Row],[支払条件コード]],PmtTerms[],4,0),\"\")","v":0}]
["0000000001430","KN-001430","㈱はくばく","はくばく",{"$f":"LENB(Suppliers[[#This Row],[省略名称（半角18,全角9文字以下）]])","v":8},"12VF",{"$f":"VLOOKUP(Suppliers[[#This Row],[支払条件コード]],PmtTerms[#All],2,0)","v":"月末〆４５日後払"},{"$f":"IFERROR(VLOOKUP(Suppliers[[#This Row],[支払条件コード]],PmtTerms[],3,0),\"\")","v":2},{"$f":"IFERROR(VLOOKUP(Suppliers[[#This Row],[支払条件コード]],PmtTerms[],4,0),\"\")","v":15}]
["0000000001451","KN-001451","東京保存食糧㈱","東京保存食糧",{"$f":"LENB(Suppliers[[#This Row],[省略名称（半角18,全角9文字以下）]])","v":12},"11VK",{"$f":"VLOOKUP(Suppliers[[#This Row],[支払条件コード]],PmtTerms[#All],2,0)","v":"月末〆２０日後払"},{"$f":"IFERROR(VLOOKUP(Suppliers[[#This Row],[支払条件コード]],PmtTerms[],3,0),\"\")","v":1},{"$f":"IFERROR(VLOOKUP(Suppliers[[#This Row],[支払条件コード]],PmtTerms[],4,0),\"\")","v":20}]
["0000000001478","KN-001478","森井食品㈱","森井食品",{"$f":"LENB(Suppliers[[#This Row],[省略名称（半角18,全角9文字以下）]])","v":8},"12VV",{"$f":"VLOOKUP(Suppliers[[#This Row],[支払条件コード]],PmtTerms[#All],2,0)","v":"月末〆６０日後払"},{"$f":"IFERROR(VLOOKUP(Suppliers[[#This Row],[支払条件コード]],PmtTerms[],3,0),\"\")","v":3},{"$f":"IFERROR(VLOOKUP(Suppliers[[#This Row],[支払条件コード]],PmtTerms[],4,0),\"\")","v":0}]
["0000000001495","KN-001495","木村飲料㈱（吉田工場）","木村飲料(吉田工場)",{"$f":"LENB(Suppliers[[#This Row],[省略名称（半角18,全角9文字以下）]])","v":18},"12VV",{"$f":"VLOOKUP(Suppliers[[#This Row],[支払条件コード]],PmtTerms[#All],2,0)","v":"月末〆６０日後払"},{"$f":"IFERROR(VLOOKUP(Suppliers[[#This Row],[支払条件コード]],PmtTerms[],3,0),\"\")","v":3},{"$f":"IFERROR(VLOOKUP(Suppliers[[#This Row],[支払条件コード]],PmtTerms[],4,0),\"\")","v":0}]
["0000000001522","KN-001522","日本製麻㈱ボルガノ食品事業部","日本製麻",{"$f":"LENB(Suppliers[[#This Row],[省略名称（半角18,全角9文字以下）]])","v":8},"12VV",{"$f":"VLOOKUP(Suppliers[[#This Row],[支払条件コード]],PmtTerms[#All],2,0)","v":"月末〆６０日後払"},{"$f":"IFERROR(VLOOKUP(Suppliers[[#This Row],[支払条件コード]],PmtTerms[],3,0),\"\")","v":3},{"$f":"IFERROR(VLOOKUP(Suppliers[[#This Row],[支払条件コード]],PmtTerms[],4,0),\"\")","v":0}]
["0000000001546","KN-001546","フライスタ－㈱","フライスタ－",{"$f":"LENB(Suppliers[[#This Row],[省略名称（半角18,全角9文字以下）]])","v":12},"12V5",{"$f":"VLOOKUP(Suppliers[[#This Row],[支払条件コード]],PmtTerms[#All],2,0)","v":"月末〆３５日後払"},{"$f":"IFERROR(VLOOKUP(Suppliers[[#This Row],[支払条件コード]],PmtTerms[],3,0),\"\")","v":2},{"$f":"IFERROR(VLOOKUP(Suppliers[[#This Row],[支払条件コード]],PmtTerms[],4,0),\"\")","v":5}]
["0000000001553","KN-001553","横浜食糧㈱","横浜食糧",{"$f":"LENB(Suppliers[[#This Row],[省略名称（半角18,全角9文字以下）]])","v":8},"12VV",{"$f":"VLOOKUP(Suppliers[[#This Row],[支払条件コード]],PmtTerms[#All],2,0)","v":"月末〆６０日後払"},{"$f":"IFERROR(VLOOKUP(Suppliers[[#This Row],[支払条件コード]],PmtTerms[],3,0),\"\")","v":3},{"$f":"IFERROR(VLOOKUP(Suppliers[[#This Row],[支払条件コード]],PmtTerms[],4,0),\"\")","v":0}]
["0000000001577","KN-001577","川光商事㈱","川光商事",{"$f":"LENB(Suppliers[[#This Row],[省略名称（半角18,全角9文字以下）]])","v":8},"12VV",{"$f":"VLOOKUP(Suppliers[[#This Row],[支払条件コード]],PmtTerms[#All],2,0)","v":"月末〆６０日後払"},{"$f":"IFERROR(VLOOKUP(Suppliers[[#This Row],[支払条件コード]],PmtTerms[],3,0),\"\")","v":3},{"$f":"IFERROR(VLOOKUP(Suppliers[[#This Row],[支払条件コード]],PmtTerms[],4,0),\"\")","v":0}]
["0000000001614","KN-001614","田中製餡㈱","田中製餡",{"$f":"LENB(Suppliers[[#This Row],[省略名称（半角18,全角9文字以下）]])","v":8},"11VV",{"$f":"VLOOKUP(Suppliers[[#This Row],[支払条件コード]],PmtTerms[#All],2,0)","v":"月末〆３０日後払"},{"$f":"IFERROR(VLOOKUP(Suppliers[[#This Row],[支払条件コード]],PmtTerms[],3,0),\"\")","v":2},{"$f":"IFERROR(VLOOKUP(Suppliers[[#This Row],[支払条件コード]],PmtTerms[],4,0),\"\")","v":0}]
["0000000001621","KN-001621","三井物産㈱　富士食品製品","三井物産(富士食品)",{"$f":"LENB(Suppliers[[#This Row],[省略名称（半角18,全角9文字以下）]])","v":18},"12VV",{"$f":"VLOOKUP(Suppliers[[#This Row],[支払条件コード]],PmtTerms[#All],2,0)","v":"月末〆６０日後払"},{"$f":"IFERROR(VLOOKUP(Suppliers[[#This Row],[支払条件コード]],PmtTerms[],3,0),\"\")","v":3},{"$f":"IFERROR(VLOOKUP(Suppliers[[#This Row],[支払条件コード]],PmtTerms[],4,0),\"\")","v":0}]
["0000000001645","KN-001645","㈱創味食品","創味食品",{"$f":"LENB(Suppliers[[#This Row],[省略名称（半角18,全角9文字以下）]])","v":8},"12VV",{"$f":"VLOOKUP(Suppliers[[#This Row],[支払条件コード]],PmtTerms[#All],2,0)","v":"月末〆６０日後払"},{"$f":"IFERROR(VLOOKUP(Suppliers[[#This Row],[支払条件コード]],PmtTerms[],3,0),\"\")","v":3},{"$f":"IFERROR(VLOOKUP(Suppliers[[#This Row],[支払条件コード]],PmtTerms[],4,0),\"\")","v":0}]
["0000000001652","KN-001652","真富士屋食品㈱","真富士屋食品",{"$f":"LENB(Suppliers[[#This Row],[省略名称（半角18,全角9文字以下）]])","v":12},"12VV",{"$f":"VLOOKUP(Suppliers[[#This Row],[支払条件コード]],PmtTerms[#All],2,0)","v":"月末〆６０日後払"},{"$f":"IFERROR(VLOOKUP(Suppliers[[#This Row],[支払条件コード]],PmtTerms[],3,0),\"\")","v":3},{"$f":"IFERROR(VLOOKUP(Suppliers[[#This Row],[支払条件コード]],PmtTerms[],4,0),\"\")","v":0}]
["0000000001669","KN-001669","エバラ食品工業㈱","エバラ食品工業",{"$f":"LENB(Suppliers[[#This Row],[省略名称（半角18,全角9文字以下）]])","v":14},"12VP",{"$f":"VLOOKUP(Suppliers[[#This Row],[支払条件コード]],PmtTerms[#All],2,0)","v":"月末〆５５日後払"},{"$f":"IFERROR(VLOOKUP(Suppliers[[#This Row],[支払条件コード]],PmtTerms[],3,0),\"\")","v":2},{"$f":"IFERROR(VLOOKUP(Suppliers[[#This Row],[支払条件コード]],PmtTerms[],4,0),\"\")","v":25}]
["0000000001676","KN-001676","㈱榮村商店","榮村商店",{"$f":"LENB(Suppliers[[#This Row],[省略名称（半角18,全角9文字以下）]])","v":8},"12VV",{"$f":"VLOOKUP(Suppliers[[#This Row],[支払条件コード]],PmtTerms[#All],2,0)","v":"月末〆６０日後払"},{"$f":"IFERROR(VLOOKUP(Suppliers[[#This Row],[支払条件コード]],PmtTerms[],3,0),\"\")","v":3},{"$f":"IFERROR(VLOOKUP(Suppliers[[#This Row],[支払条件コード]],PmtTerms[],4,0),\"\")","v":0}]
["0000000001690","KN-001690","三井物産㈱　丸美屋フ－ズ","三井物産(丸美屋)",{"$f":"LENB(Suppliers[[#This Row],[省略名称（半角18,全角9文字以下）]])","v":16},"12VV",{"$f":"VLOOKUP(Suppliers[[#This Row],[支払条件コード]],PmtTerms[#All],2,0)","v":"月末〆６０日後払"},{"$f":"IFERROR(VLOOKUP(Suppliers[[#This Row],[支払条件コード]],PmtTerms[],3,0),\"\")","v":3},{"$f":"IFERROR(VLOOKUP(Suppliers[[#This Row],[支払条件コード]],PmtTerms[],4,0),\"\")","v":0}]
["0000000001713","KN-001713","諸口","諸口",{"$f":"LENB(Suppliers[[#This Row],[省略名称（半角18,全角9文字以下）]])","v":4},"10PV",{"$f":"VLOOKUP(Suppliers[[#This Row],[支払条件コード]],PmtTerms[#All],2,0)","v":"２５日〆５日後払"},{"$f":"IFERROR(VLOOKUP(Suppliers[[#This Row],[支払条件コード]],PmtTerms[],3,0),\"\")","v":1},{"$f":"IFERROR(VLOOKUP(Suppliers[[#This Row],[支払条件コード]],PmtTerms[],4,0),\"\")","v":0}]
["0000000001720","KN-001720","丸和油脂㈱","丸和油脂",{"$f":"LENB(Suppliers[[#This Row],[省略名称（半角18,全角9文字以下）]])","v":8},"12VV",{"$f":"VLOOKUP(Suppliers[[#This Row],[支払条件コード]],PmtTerms[#All],2,0)","v":"月末〆６０日後払"},{"$f":"IFERROR(VLOOKUP(Suppliers[[#This Row],[支払条件コード]],PmtTerms[],3,0),\"\")","v":3},{"$f":"IFERROR(VLOOKUP(Suppliers[[#This Row],[支払条件コード]],PmtTerms[],4,0),\"\")","v":0}]
["0000000001737","KN-001737","平和食品工業㈱","平和食品工業",{"$f":"LENB(Suppliers[[#This Row],[省略名称（半角18,全角9文字以下）]])","v":12},"11VV",{"$f":"VLOOKUP(Suppliers[[#This Row],[支払条件コード]],PmtTerms[#All],2,0)","v":"月末〆３０日後払"},{"$f":"IFERROR(VLOOKUP(Suppliers[[#This Row],[支払条件コード]],PmtTerms[],3,0),\"\")","v":2},{"$f":"IFERROR(VLOOKUP(Suppliers[[#This Row],[支払条件コード]],PmtTerms[],4,0),\"\")","v":0}]
["0000000001741","KN-001741","和弘食品㈱","和弘食品",{"$f":"LENB(Suppliers[[#This Row],[省略名称（半角18,全角9文字以下）]])","v":8},"12VV",{"$f":"VLOOKUP(Suppliers[[#This Row],[支払条件コード]],PmtTerms[#All],2,0)","v":"月末〆６０日後払"},{"$f":"IFERROR(VLOOKUP(Suppliers[[#This Row],[支払条件コード]],PmtTerms[],3,0),\"\")","v":3},{"$f":"IFERROR(VLOOKUP(Suppliers[[#This Row],[支払条件コード]],PmtTerms[],4,0),\"\")","v":0}]
["0000000001751","KN-001751","太陽商事㈱","太陽商事",{"$f":"LENB(Suppliers[[#This Row],[省略名称（半角18,全角9文字以下）]])","v":8},"12VV",{"$f":"VLOOKUP(Suppliers[[#This Row],[支払条件コード]],PmtTerms[#All],2,0)","v":"月末〆６０日後払"},{"$f":"IFERROR(VLOOKUP(Suppliers[[#This Row],[支払条件コード]],PmtTerms[],3,0),\"\")","v":3},{"$f":"IFERROR(VLOOKUP(Suppliers[[#This Row],[支払条件コード]],PmtTerms[],4,0),\"\")","v":0}]
["0000000001775","KN-001775","国分首都圏株式会社","国分首都圏",{"$f":"LENB(Suppliers[[#This Row],[省略名称（半角18,全角9文字以下）]])","v":10},"12VV",{"$f":"VLOOKUP(Suppliers[[#This Row],[支払条件コード]],PmtTerms[#All],2,0)","v":"月末〆６０日後払"},{"$f":"IFERROR(VLOOKUP(Suppliers[[#This Row],[支払条件コード]],PmtTerms[],3,0),\"\")","v":3},{"$f":"IFERROR(VLOOKUP(Suppliers[[#This Row],[支払条件コード]],PmtTerms[],4,0),\"\")","v":0}]
["0000000001818","KN-001818","福）名古屋ﾗｲﾄﾊｳｽKAN食品開発ｾﾝﾀ","名古屋ﾗｲﾄﾊｳｽKAN",{"$f":"LENB(Suppliers[[#This Row],[省略名称（半角18,全角9文字以下）]])","v":15},"11VV",{"$f":"VLOOKUP(Suppliers[[#This Row],[支払条件コード]],PmtTerms[#All],2,0)","v":"月末〆３０日後払"},{"$f":"IFERROR(VLOOKUP(Suppliers[[#This Row],[支払条件コード]],PmtTerms[],3,0),\"\")","v":2},{"$f":"IFERROR(VLOOKUP(Suppliers[[#This Row],[支払条件コード]],PmtTerms[],4,0),\"\")","v":0}]
["0000000001831","KN-001831","大信実業株式会社","大信実業",{"$f":"LENB(Suppliers[[#This Row],[省略名称（半角18,全角9文字以下）]])","v":8},"12VV",{"$f":"VLOOKUP(Suppliers[[#This Row],[支払条件コード]],PmtTerms[#All],2,0)","v":"月末〆６０日後払"},{"$f":"IFERROR(VLOOKUP(Suppliers[[#This Row],[支払条件コード]],PmtTerms[],3,0),\"\")","v":3},{"$f":"IFERROR(VLOOKUP(Suppliers[[#This Row],[支払条件コード]],PmtTerms[],4,0),\"\")","v":0}]
["0000000001850","KN-001850","天狗缶詰株式会社　東京営業所","天狗缶詰",{"$f":"LENB(Suppliers[[#This Row],[省略名称（半角18,全角9文字以下）]])","v":8},"12VV",{"$f":"VLOOKUP(Suppliers[[#This Row],[支払条件コード]],PmtTerms[#All],2,0)","v":"月末〆６０日後払"},{"$f":"IFERROR(VLOOKUP(Suppliers[[#This Row],[支払条件コード]],PmtTerms[],3,0),\"\")","v":3},{"$f":"IFERROR(VLOOKUP(Suppliers[[#This Row],[支払条件コード]],PmtTerms[],4,0),\"\")","v":0}]
["0000000001855","KN-001855","ミドリ安全㈱","ミドリ安全",{"$f":"LENB(Suppliers[[#This Row],[省略名称（半角18,全角9文字以下）]])","v":10},"11VV",{"$f":"VLOOKUP(Suppliers[[#This Row],[支払条件コード]],PmtTerms[#All],2,0)","v":"月末〆３０日後払"},{"$f":"IFERROR(VLOOKUP(Suppliers[[#This Row],[支払条件コード]],PmtTerms[],3,0),\"\")","v":2},{"$f":"IFERROR(VLOOKUP(Suppliers[[#This Row],[支払条件コード]],PmtTerms[],4,0),\"\")","v":0}]
["0000000001898","KN-001898","三栄フーズ株式会社","三栄フーズ",{"$f":"LENB(Suppliers[[#This Row],[省略名称（半角18,全角9文字以下）]])","v":10},"11VV",{"$f":"VLOOKUP(Suppliers[[#This Row],[支払条件コード]],PmtTerms[#All],2,0)","v":"月末〆３０日後払"},{"$f":"IFERROR(VLOOKUP(Suppliers[[#This Row],[支払条件コード]],PmtTerms[],3,0),\"\")","v":2},{"$f":"IFERROR(VLOOKUP(Suppliers[[#This Row],[支払条件コード]],PmtTerms[],4,0),\"\")","v":0}]
["0000000001942","KN-001942","東洋水産㈱スープ","東洋水産(スープ)",{"$f":"LENB(Suppliers[[#This Row],[省略名称（半角18,全角9文字以下）]])","v":16},"11VV",{"$f":"VLOOKUP(Suppliers[[#This Row],[支払条件コード]],PmtTerms[#All],2,0)","v":"月末〆３０日後払"},{"$f":"IFERROR(VLOOKUP(Suppliers[[#This Row],[支払条件コード]],PmtTerms[],3,0),\"\")","v":2},{"$f":"IFERROR(VLOOKUP(Suppliers[[#This Row],[支払条件コード]],PmtTerms[],4,0),\"\")","v":0}]
["0000000001959","KN-001959","㈱日本サンガリア","日本サンガリア",{"$f":"LENB(Suppliers[[#This Row],[省略名称（半角18,全角9文字以下）]])","v":14},"11VV",{"$f":"VLOOKUP(Suppliers[[#This Row],[支払条件コード]],PmtTerms[#All],2,0)","v":"月末〆３０日後払"},{"$f":"IFERROR(VLOOKUP(Suppliers[[#This Row],[支払条件コード]],PmtTerms[],3,0),\"\")","v":2},{"$f":"IFERROR(VLOOKUP(Suppliers[[#This Row],[支払条件コード]],PmtTerms[],4,0),\"\")","v":0}]
["0000000001967","KN-001967","㈱神明","神明",{"$f":"LENB(Suppliers[[#This Row],[省略名称（半角18,全角9文字以下）]])","v":4},"12VV",{"$f":"VLOOKUP(Suppliers[[#This Row],[支払条件コード]],PmtTerms[#All],2,0)","v":"月末〆６０日後払"},{"$f":"IFERROR(VLOOKUP(Suppliers[[#This Row],[支払条件コード]],PmtTerms[],3,0),\"\")","v":3},{"$f":"IFERROR(VLOOKUP(Suppliers[[#This Row],[支払条件コード]],PmtTerms[],4,0),\"\")","v":0}]
["0000000001985","KN-001985","宮島醤油㈱","宮島醤油",{"$f":"LENB(Suppliers[[#This Row],[省略名称（半角18,全角9文字以下）]])","v":8},"12VV",{"$f":"VLOOKUP(Suppliers[[#This Row],[支払条件コード]],PmtTerms[#All],2,0)","v":"月末〆６０日後払"},{"$f":"IFERROR(VLOOKUP(Suppliers[[#This Row],[支払条件コード]],PmtTerms[],3,0),\"\")","v":3},{"$f":"IFERROR(VLOOKUP(Suppliers[[#This Row],[支払条件コード]],PmtTerms[],4,0),\"\")","v":0}]
["0000000002013","KN-002013","三井物産㈱Ｊ－オイルミルズ","三井物産(ｵｲﾙﾐﾙｽﾞ)",{"$f":"LENB(Suppliers[[#This Row],[省略名称（半角18,全角9文字以下）]])","v":17},"12VV",{"$f":"VLOOKUP(Suppliers[[#This Row],[支払条件コード]],PmtTerms[#All],2,0)","v":"月末〆６０日後払"},{"$f":"IFERROR(VLOOKUP(Suppliers[[#This Row],[支払条件コード]],PmtTerms[],3,0),\"\")","v":3},{"$f":"IFERROR(VLOOKUP(Suppliers[[#This Row],[支払条件コード]],PmtTerms[],4,0),\"\")","v":0}]
["0000000002020","KN-002020","三井物産㈱","三井物産",{"$f":"LENB(Suppliers[[#This Row],[省略名称（半角18,全角9文字以下）]])","v":8},"12VV",{"$f":"VLOOKUP(Suppliers[[#This Row],[支払条件コード]],PmtTerms[#All],2,0)","v":"月末〆６０日後払"},{"$f":"IFERROR(VLOOKUP(Suppliers[[#This Row],[支払条件コード]],PmtTerms[],3,0),\"\")","v":3},{"$f":"IFERROR(VLOOKUP(Suppliers[[#This Row],[支払条件コード]],PmtTerms[],4,0),\"\")","v":0}]
["0000000002037","KN-002037","岩井の胡麻油㈱","岩井の胡麻油",{"$f":"LENB(Suppliers[[#This Row],[省略名称（半角18,全角9文字以下）]])","v":12},"12VV",{"$f":"VLOOKUP(Suppliers[[#This Row],[支払条件コード]],PmtTerms[#All],2,0)","v":"月末〆６０日後払"},{"$f":"IFERROR(VLOOKUP(Suppliers[[#This Row],[支払条件コード]],PmtTerms[],3,0),\"\")","v":3},{"$f":"IFERROR(VLOOKUP(Suppliers[[#This Row],[支払条件コード]],PmtTerms[],4,0),\"\")","v":0}]
["0000000002044","KN-002044","三井物産㈱　かどや製油","三井物産(かどや)",{"$f":"LENB(Suppliers[[#This Row],[省略名称（半角18,全角9文字以下）]])","v":16},"12VV",{"$f":"VLOOKUP(Suppliers[[#This Row],[支払条件コード]],PmtTerms[#All],2,0)","v":"月末〆６０日後払"},{"$f":"IFERROR(VLOOKUP(Suppliers[[#This Row],[支払条件コード]],PmtTerms[],3,0),\"\")","v":3},{"$f":"IFERROR(VLOOKUP(Suppliers[[#This Row],[支払条件コード]],PmtTerms[],4,0),\"\")","v":0}]
["0000000002075","KN-002075","ユアサ・フナショク株式会社","ユアサ・フナショク",{"$f":"LENB(Suppliers[[#This Row],[省略名称（半角18,全角9文字以下）]])","v":18},"10PV",{"$f":"VLOOKUP(Suppliers[[#This Row],[支払条件コード]],PmtTerms[#All],2,0)","v":"２５日〆５日後払"},{"$f":"IFERROR(VLOOKUP(Suppliers[[#This Row],[支払条件コード]],PmtTerms[],3,0),\"\")","v":1},{"$f":"IFERROR(VLOOKUP(Suppliers[[#This Row],[支払条件コード]],PmtTerms[],4,0),\"\")","v":0}]
["0000000002099","KN-002099","日新蜂蜜㈱","日新蜂蜜",{"$f":"LENB(Suppliers[[#This Row],[省略名称（半角18,全角9文字以下）]])","v":8},"12VV",{"$f":"VLOOKUP(Suppliers[[#This Row],[支払条件コード]],PmtTerms[#All],2,0)","v":"月末〆６０日後払"},{"$f":"IFERROR(VLOOKUP(Suppliers[[#This Row],[支払条件コード]],PmtTerms[],3,0),\"\")","v":3},{"$f":"IFERROR(VLOOKUP(Suppliers[[#This Row],[支払条件コード]],PmtTerms[],4,0),\"\")","v":0}]
["0000000002150","KN-002150","㈱ダイヤスター","ダイヤスター",{"$f":"LENB(Suppliers[[#This Row],[省略名称（半角18,全角9文字以下）]])","v":12},"12VV",{"$f":"VLOOKUP(Suppliers[[#This Row],[支払条件コード]],PmtTerms[#All],2,0)","v":"月末〆６０日後払"},{"$f":"IFERROR(VLOOKUP(Suppliers[[#This Row],[支払条件コード]],PmtTerms[],3,0),\"\")","v":3},{"$f":"IFERROR(VLOOKUP(Suppliers[[#This Row],[支払条件コード]],PmtTerms[],4,0),\"\")","v":0}]
["0000000002198","KN-002198","㈱内田からし","内田からし",{"$f":"LENB(Suppliers[[#This Row],[省略名称（半角18,全角9文字以下）]])","v":10},"11VV",{"$f":"VLOOKUP(Suppliers[[#This Row],[支払条件コード]],PmtTerms[#All],2,0)","v":"月末〆３０日後払"},{"$f":"IFERROR(VLOOKUP(Suppliers[[#This Row],[支払条件コード]],PmtTerms[],3,0),\"\")","v":2},{"$f":"IFERROR(VLOOKUP(Suppliers[[#This Row],[支払条件コード]],PmtTerms[],4,0),\"\")","v":0}]
["0000000002230","KN-002230","㈱シモヤマ","シモヤマ",{"$f":"LENB(Suppliers[[#This Row],[省略名称（半角18,全角9文字以下）]])","v":8},"11VV",{"$f":"VLOOKUP(Suppliers[[#This Row],[支払条件コード]],PmtTerms[#All],2,0)","v":"月末〆３０日後払"},{"$f":"IFERROR(VLOOKUP(Suppliers[[#This Row],[支払条件コード]],PmtTerms[],3,0),\"\")","v":2},{"$f":"IFERROR(VLOOKUP(Suppliers[[#This Row],[支払条件コード]],PmtTerms[],4,0),\"\")","v":0}]
["0000000002235","KN-002235","上越スタ－チ㈱","上越スタ－チ",{"$f":"LENB(Suppliers[[#This Row],[省略名称（半角18,全角9文字以下）]])","v":12},"12VV",{"$f":"VLOOKUP(Suppliers[[#This Row],[支払条件コード]],PmtTerms[#All],2,0)","v":"月末〆６０日後払"},{"$f":"IFERROR(VLOOKUP(Suppliers[[#This Row],[支払条件コード]],PmtTerms[],3,0),\"\")","v":3},{"$f":"IFERROR(VLOOKUP(Suppliers[[#This Row],[支払条件コード]],PmtTerms[],4,0),\"\")","v":0}]
["0000000002245","KN-002245","籠島澱粉㈱","籠島澱粉",{"$f":"LENB(Suppliers[[#This Row],[省略名称（半角18,全角9文字以下）]])","v":8},"11VV",{"$f":"VLOOKUP(Suppliers[[#This Row],[支払条件コード]],PmtTerms[#All],2,0)","v":"月末〆３０日後払"},{"$f":"IFERROR(VLOOKUP(Suppliers[[#This Row],[支払条件コード]],PmtTerms[],3,0),\"\")","v":2},{"$f":"IFERROR(VLOOKUP(Suppliers[[#This Row],[支払条件コード]],PmtTerms[],4,0),\"\")","v":0}]
["0000000002265","KN-002265","たかい食品㈱","たかい食品",{"$f":"LENB(Suppliers[[#This Row],[省略名称（半角18,全角9文字以下）]])","v":10},"11VV",{"$f":"VLOOKUP(Suppliers[[#This Row],[支払条件コード]],PmtTerms[#All],2,0)","v":"月末〆３０日後払"},{"$f":"IFERROR(VLOOKUP(Suppliers[[#This Row],[支払条件コード]],PmtTerms[],3,0),\"\")","v":2},{"$f":"IFERROR(VLOOKUP(Suppliers[[#This Row],[支払条件コード]],PmtTerms[],4,0),\"\")","v":0}]
["0000000002285","KN-002285","三幸食品株式会社","三幸食品",{"$f":"LENB(Suppliers[[#This Row],[省略名称（半角18,全角9文字以下）]])","v":8},"0001",{"$f":"VLOOKUP(Suppliers[[#This Row],[支払条件コード]],PmtTerms[#All],2,0)","v":"計上後即時"},{"$f":"IFERROR(VLOOKUP(Suppliers[[#This Row],[支払条件コード]],PmtTerms[],3,0),\"\")","v":0},{"$f":"IFERROR(VLOOKUP(Suppliers[[#This Row],[支払条件コード]],PmtTerms[],4,0),\"\")","v":0}]
["0000000002297","KN-002297","兼松食品㈱","兼松食品",{"$f":"LENB(Suppliers[[#This Row],[省略名称（半角18,全角9文字以下）]])","v":8},"12VF",{"$f":"VLOOKUP(Suppliers[[#This Row],[支払条件コード]],PmtTerms[#All],2,0)","v":"月末〆４５日後払"},{"$f":"IFERROR(VLOOKUP(Suppliers[[#This Row],[支払条件コード]],PmtTerms[],3,0),\"\")","v":2},{"$f":"IFERROR(VLOOKUP(Suppliers[[#This Row],[支払条件コード]],PmtTerms[],4,0),\"\")","v":15}]
["0000000002303","KN-002303","金田屋㈱","金田屋",{"$f":"LENB(Suppliers[[#This Row],[省略名称（半角18,全角9文字以下）]])","v":6},"11VV",{"$f":"VLOOKUP(Suppliers[[#This Row],[支払条件コード]],PmtTerms[#All],2,0)","v":"月末〆３０日後払"},{"$f":"IFERROR(VLOOKUP(Suppliers[[#This Row],[支払条件コード]],PmtTerms[],3,0),\"\")","v":2},{"$f":"IFERROR(VLOOKUP(Suppliers[[#This Row],[支払条件コード]],PmtTerms[],4,0),\"\")","v":0}]
["0000000002305","KN-002305","㈱鈴木屋（砂糖分）","鈴木屋（砂糖分）",{"$f":"LENB(Suppliers[[#This Row],[省略名称（半角18,全角9文字以下）]])","v":16},"11VV",{"$f":"VLOOKUP(Suppliers[[#This Row],[支払条件コード]],PmtTerms[#All],2,0)","v":"月末〆３０日後払"},{"$f":"IFERROR(VLOOKUP(Suppliers[[#This Row],[支払条件コード]],PmtTerms[],3,0),\"\")","v":2},{"$f":"IFERROR(VLOOKUP(Suppliers[[#This Row],[支払条件コード]],PmtTerms[],4,0),\"\")","v":0}]
["0000000002310","KN-002310","㈱伊豆フェルメンテ","伊豆フェルメンテ",{"$f":"LENB(Suppliers[[#This Row],[省略名称（半角18,全角9文字以下）]])","v":16},"12VV",{"$f":"VLOOKUP(Suppliers[[#This Row],[支払条件コード]],PmtTerms[#All],2,0)","v":"月末〆６０日後払"},{"$f":"IFERROR(VLOOKUP(Suppliers[[#This Row],[支払条件コード]],PmtTerms[],3,0),\"\")","v":3},{"$f":"IFERROR(VLOOKUP(Suppliers[[#This Row],[支払条件コード]],PmtTerms[],4,0),\"\")","v":0}]
["0000000002396","KN-002396","㈱相原商店","相原商店",{"$f":"LENB(Suppliers[[#This Row],[省略名称（半角18,全角9文字以下）]])","v":8},"11VV",{"$f":"VLOOKUP(Suppliers[[#This Row],[支払条件コード]],PmtTerms[#All],2,0)","v":"月末〆３０日後払"},{"$f":"IFERROR(VLOOKUP(Suppliers[[#This Row],[支払条件コード]],PmtTerms[],3,0),\"\")","v":2},{"$f":"IFERROR(VLOOKUP(Suppliers[[#This Row],[支払条件コード]],PmtTerms[],4,0),\"\")","v":0}]
["0000000002440","KN-002440","㈱マスキチ","マスキチ",{"$f":"LENB(Suppliers[[#This Row],[省略名称（半角18,全角9文字以下）]])","v":8},"12VV",{"$f":"VLOOKUP(Suppliers[[#This Row],[支払条件コード]],PmtTerms[#All],2,0)","v":"月末〆６０日後払"},{"$f":"IFERROR(VLOOKUP(Suppliers[[#This Row],[支払条件コード]],PmtTerms[],3,0),\"\")","v":3},{"$f":"IFERROR(VLOOKUP(Suppliers[[#This Row],[支払条件コード]],PmtTerms[],4,0),\"\")","v":0}]
["0000000002457","KN-002457","横関油脂工業㈱","横関油脂工業",{"$f":"LENB(Suppliers[[#This Row],[省略名称（半角18,全角9文字以下）]])","v":12},"12VV",{"$f":"VLOOKUP(Suppliers[[#This Row],[支払条件コード]],PmtTerms[#All],2,0)","v":"月末〆６０日後払"},{"$f":"IFERROR(VLOOKUP(Suppliers[[#This Row],[支払条件コード]],PmtTerms[],3,0),\"\")","v":3},{"$f":"IFERROR(VLOOKUP(Suppliers[[#This Row],[支払条件コード]],PmtTerms[],4,0),\"\")","v":0}]
["0000000002495","KN-002495","㈱J-NIKKAﾊﾟｰﾄﾅｰｽﾞ","J-NIKKAﾊﾟｰﾄﾅｰｽﾞ",{"$f":"LENB(Suppliers[[#This Row],[省略名称（半角18,全角9文字以下）]])","v":15},"12VV",{"$f":"VLOOKUP(Suppliers[[#This Row],[支払条件コード]],PmtTerms[#All],2,0)","v":"月末〆６０日後払"},{"$f":"IFERROR(VLOOKUP(Suppliers[[#This Row],[支払条件コード]],PmtTerms[],3,0),\"\")","v":3},{"$f":"IFERROR(VLOOKUP(Suppliers[[#This Row],[支払条件コード]],PmtTerms[],4,0),\"\")","v":0}]
["0000000002549","KN-002549","㈱鈴木屋","鈴木屋",{"$f":"LENB(Suppliers[[#This Row],[省略名称（半角18,全角9文字以下）]])","v":6},"12VV",{"$f":"VLOOKUP(Suppliers[[#This Row],[支払条件コード]],PmtTerms[#All],2,0)","v":"月末〆６０日後払"},{"$f":"IFERROR(VLOOKUP(Suppliers[[#This Row],[支払条件コード]],PmtTerms[],3,0),\"\")","v":3},{"$f":"IFERROR(VLOOKUP(Suppliers[[#This Row],[支払条件コード]],PmtTerms[],4,0),\"\")","v":0}]
["0000000002655","KN-002655","丸松物産㈱","丸松物産",{"$f":"LENB(Suppliers[[#This Row],[省略名称（半角18,全角9文字以下）]])","v":8},"12VV",{"$f":"VLOOKUP(Suppliers[[#This Row],[支払条件コード]],PmtTerms[#All],2,0)","v":"月末〆６０日後払"},{"$f":"IFERROR(VLOOKUP(Suppliers[[#This Row],[支払条件コード]],PmtTerms[],3,0),\"\")","v":3},{"$f":"IFERROR(VLOOKUP(Suppliers[[#This Row],[支払条件コード]],PmtTerms[],4,0),\"\")","v":0}]
["0000000002661","KN-002661","京浜貿易㈱","京浜貿易",{"$f":"LENB(Suppliers[[#This Row],[省略名称（半角18,全角9文字以下）]])","v":8},"12VV",{"$f":"VLOOKUP(Suppliers[[#This Row],[支払条件コード]],PmtTerms[#All],2,0)","v":"月末〆６０日後払"},{"$f":"IFERROR(VLOOKUP(Suppliers[[#This Row],[支払条件コード]],PmtTerms[],3,0),\"\")","v":3},{"$f":"IFERROR(VLOOKUP(Suppliers[[#This Row],[支払条件コード]],PmtTerms[],4,0),\"\")","v":0}]
["0000000002716","KN-002716","国光オブラート株式会社","国光オブラート",{"$f":"LENB(Suppliers[[#This Row],[省略名称（半角18,全角9文字以下）]])","v":14},"12VV",{"$f":"VLOOKUP(Suppliers[[#This Row],[支払条件コード]],PmtTerms[#All],2,0)","v":"月末〆６０日後払"},{"$f":"IFERROR(VLOOKUP(Suppliers[[#This Row],[支払条件コード]],PmtTerms[],3,0),\"\")","v":3},{"$f":"IFERROR(VLOOKUP(Suppliers[[#This Row],[支払条件コード]],PmtTerms[],4,0),\"\")","v":0}]
["0000000002755","KN-002755","桜井製材","桜井製材",{"$f":"LENB(Suppliers[[#This Row],[省略名称（半角18,全角9文字以下）]])","v":8},"11VV",{"$f":"VLOOKUP(Suppliers[[#This Row],[支払条件コード]],PmtTerms[#All],2,0)","v":"月末〆３０日後払"},{"$f":"IFERROR(VLOOKUP(Suppliers[[#This Row],[支払条件コード]],PmtTerms[],3,0),\"\")","v":2},{"$f":"IFERROR(VLOOKUP(Suppliers[[#This Row],[支払条件コード]],PmtTerms[],4,0),\"\")","v":0}]
["0000000002884","KN-002884","㈱かね善","かね善",{"$f":"LENB(Suppliers[[#This Row],[省略名称（半角18,全角9文字以下）]])","v":6},"11VV",{"$f":"VLOOKUP(Suppliers[[#This Row],[支払条件コード]],PmtTerms[#All],2,0)","v":"月末〆３０日後払"},{"$f":"IFERROR(VLOOKUP(Suppliers[[#This Row],[支払条件コード]],PmtTerms[],3,0),\"\")","v":2},{"$f":"IFERROR(VLOOKUP(Suppliers[[#This Row],[支払条件コード]],PmtTerms[],4,0),\"\")","v":0}]
["0000000002901","KN-002901","佐川急便株式会社","佐川急便",{"$f":"LENB(Suppliers[[#This Row],[省略名称（半角18,全角9文字以下）]])","v":8},"11VQ",{"$f":"VLOOKUP(Suppliers[[#This Row],[支払条件コード]],PmtTerms[#All],2,0)","v":"月末〆２６日後払"},{"$f":"IFERROR(VLOOKUP(Suppliers[[#This Row],[支払条件コード]],PmtTerms[],3,0),\"\")","v":1},{"$f":"IFERROR(VLOOKUP(Suppliers[[#This Row],[支払条件コード]],PmtTerms[],4,0),\"\")","v":26}]
["-","KN-009904","株式会社愛知日新","愛知日新",{"$f":"LENB(Suppliers[[#This Row],[省略名称（半角18,全角9文字以下）]])","v":8},"12VV",{"$f":"VLOOKUP(Suppliers[[#This Row],[支払条件コード]],PmtTerms[#All],2,0)","v":"月末〆６０日後払"},{"$f":"IFERROR(VLOOKUP(Suppliers[[#This Row],[支払条件コード]],PmtTerms[],3,0),\"\")","v":3},{"$f":"IFERROR(VLOOKUP(Suppliers[[#This Row],[支払条件コード]],PmtTerms[],4,0),\"\")","v":0}]
["-","KN-009905","鶴見倉庫株式会社","鶴見倉庫",{"$f":"LENB(Suppliers[[#This Row],[省略名称（半角18,全角9文字以下）]])","v":8},"12VV",{"$f":"VLOOKUP(Suppliers[[#This Row],[支払条件コード]],PmtTerms[#All],2,0)","v":"月末〆６０日後払"},{"$f":"IFERROR(VLOOKUP(Suppliers[[#This Row],[支払条件コード]],PmtTerms[],3,0),\"\")","v":3},{"$f":"IFERROR(VLOOKUP(Suppliers[[#This Row],[支払条件コード]],PmtTerms[],4,0),\"\")","v":0}]
["-","KN-009922","日新航空サービス株式会社","日新航空サービス",{"$f":"LENB(Suppliers[[#This Row],[省略名称（半角18,全角9文字以下）]])","v":16},"12VV",{"$f":"VLOOKUP(Suppliers[[#This Row],[支払条件コード]],PmtTerms[#All],2,0)","v":"月末〆６０日後払"},{"$f":"IFERROR(VLOOKUP(Suppliers[[#This Row],[支払条件コード]],PmtTerms[],3,0),\"\")","v":3},{"$f":"IFERROR(VLOOKUP(Suppliers[[#This Row],[支払条件コード]],PmtTerms[],4,0),\"\")","v":0}]
["-","KN-009924","日新梱包株式会社","日新梱包",{"$f":"LENB(Suppliers[[#This Row],[省略名称（半角18,全角9文字以下）]])","v":8},"12VV",{"$f":"VLOOKUP(Suppliers[[#This Row],[支払条件コード]],PmtTerms[#All],2,0)","v":"月末〆６０日後払"},{"$f":"IFERROR(VLOOKUP(Suppliers[[#This Row],[支払条件コード]],PmtTerms[],3,0),\"\")","v":3},{"$f":"IFERROR(VLOOKUP(Suppliers[[#This Row],[支払条件コード]],PmtTerms[],4,0),\"\")","v":0}]
["-","KN-009926","株式会社丸新","丸新",{"$f":"LENB(Suppliers[[#This Row],[省略名称（半角18,全角9文字以下）]])","v":4},"12VV",{"$f":"VLOOKUP(Suppliers[[#This Row],[支払条件コード]],PmtTerms[#All],2,0)","v":"月末〆６０日後払"},{"$f":"IFERROR(VLOOKUP(Suppliers[[#This Row],[支払条件コード]],PmtTerms[],3,0),\"\")","v":3},{"$f":"IFERROR(VLOOKUP(Suppliers[[#This Row],[支払条件コード]],PmtTerms[],4,0),\"\")","v":0}]
["-","KN-009929","株式会社北海道日新","北海道日新",{"$f":"LENB(Suppliers[[#This Row],[省略名称（半角18,全角9文字以下）]])","v":10},"12VV",{"$f":"VLOOKUP(Suppliers[[#This Row],[支払条件コード]],PmtTerms[#All],2,0)","v":"月末〆６０日後払"},{"$f":"IFERROR(VLOOKUP(Suppliers[[#This Row],[支払条件コード]],PmtTerms[],3,0),\"\")","v":3},{"$f":"IFERROR(VLOOKUP(Suppliers[[#This Row],[支払条件コード]],PmtTerms[],4,0),\"\")","v":0}]
["-","KN-009930","日新エアカーゴ株式会社","日新エアカーゴ",{"$f":"LENB(Suppliers[[#This Row],[省略名称（半角18,全角9文字以下）]])","v":14},"12VV",{"$f":"VLOOKUP(Suppliers[[#This Row],[支払条件コード]],PmtTerms[#All],2,0)","v":"月末〆６０日後払"},{"$f":"IFERROR(VLOOKUP(Suppliers[[#This Row],[支払条件コード]],PmtTerms[],3,0),\"\")","v":3},{"$f":"IFERROR(VLOOKUP(Suppliers[[#This Row],[支払条件コード]],PmtTerms[],4,0),\"\")","v":0}]
["-","KN-009937","株式会社エヌ・ディ・ティ","エヌ・ディ・ティ",{"$f":"LENB(Suppliers[[#This Row],[省略名称（半角18,全角9文字以下）]])","v":16},"12VV",{"$f":"VLOOKUP(Suppliers[[#This Row],[支払条件コード]],PmtTerms[#All],2,0)","v":"月末〆６０日後払"},{"$f":"IFERROR(VLOOKUP(Suppliers[[#This Row],[支払条件コード]],PmtTerms[],3,0),\"\")","v":3},{"$f":"IFERROR(VLOOKUP(Suppliers[[#This Row],[支払条件コード]],PmtTerms[],4,0),\"\")","v":0}]
["-","KN-009938","株式会社茨城日新","茨城日新",{"$f":"LENB(Suppliers[[#This Row],[省略名称（半角18,全角9文字以下）]])","v":8},"12VV",{"$f":"VLOOKUP(Suppliers[[#This Row],[支払条件コード]],PmtTerms[#All],2,0)","v":"月末〆６０日後払"},{"$f":"IFERROR(VLOOKUP(Suppliers[[#This Row],[支払条件コード]],PmtTerms[],3,0),\"\")","v":3},{"$f":"IFERROR(VLOOKUP(Suppliers[[#This Row],[支払条件コード]],PmtTerms[],4,0),\"\")","v":0}]
["-","KN-009940","板橋運送株式会社","板橋運送",{"$f":"LENB(Suppliers[[#This Row],[省略名称（半角18,全角9文字以下）]])","v":8},"12VV",{"$f":"VLOOKUP(Suppliers[[#This Row],[支払条件コード]],PmtTerms[#All],2,0)","v":"月末〆６０日後払"},{"$f":"IFERROR(VLOOKUP(Suppliers[[#This Row],[支払条件コード]],PmtTerms[],3,0),\"\")","v":3},{"$f":"IFERROR(VLOOKUP(Suppliers[[#This Row],[支払条件コード]],PmtTerms[],4,0),\"\")","v":0}]
["-","KN-009941","京浜不動産株式会社","京浜不動産",{"$f":"LENB(Suppliers[[#This Row],[省略名称（半角18,全角9文字以下）]])","v":10},"11VV",{"$f":"VLOOKUP(Suppliers[[#This Row],[支払条件コード]],PmtTerms[#All],2,0)","v":"月末〆３０日後払"},{"$f":"IFERROR(VLOOKUP(Suppliers[[#This Row],[支払条件コード]],PmtTerms[],3,0),\"\")","v":2},{"$f":"IFERROR(VLOOKUP(Suppliers[[#This Row],[支払条件コード]],PmtTerms[],4,0),\"\")","v":0}]
["-","KN-009949","日新産業株式会社","日新産業",{"$f":"LENB(Suppliers[[#This Row],[省略名称（半角18,全角9文字以下）]])","v":8},"12VV",{"$f":"VLOOKUP(Suppliers[[#This Row],[支払条件コード]],PmtTerms[#All],2,0)","v":"月末〆６０日後払"},{"$f":"IFERROR(VLOOKUP(Suppliers[[#This Row],[支払条件コード]],PmtTerms[],3,0),\"\")","v":3},{"$f":"IFERROR(VLOOKUP(Suppliers[[#This Row],[支払条件コード]],PmtTerms[],4,0),\"\")","v":0}]
["-","KN-009950","日誠港運株式会社","日誠港運",{"$f":"LENB(Suppliers[[#This Row],[省略名称（半角18,全角9文字以下）]])","v":8},"12VV",{"$f":"VLOOKUP(Suppliers[[#This Row],[支払条件コード]],PmtTerms[#All],2,0)","v":"月末〆６０日後払"},{"$f":"IFERROR(VLOOKUP(Suppliers[[#This Row],[支払条件コード]],PmtTerms[],3,0),\"\")","v":3},{"$f":"IFERROR(VLOOKUP(Suppliers[[#This Row],[支払条件コード]],PmtTerms[],4,0),\"\")","v":0}]
["-","KN-009953","横海陸運株式会社","横海陸運",{"$f":"LENB(Suppliers[[#This Row],[省略名称（半角18,全角9文字以下）]])","v":8},"12VV",{"$f":"VLOOKUP(Suppliers[[#This Row],[支払条件コード]],PmtTerms[#All],2,0)","v":"月末〆６０日後払"},{"$f":"IFERROR(VLOOKUP(Suppliers[[#This Row],[支払条件コード]],PmtTerms[],3,0),\"\")","v":3},{"$f":"IFERROR(VLOOKUP(Suppliers[[#This Row],[支払条件コード]],PmtTerms[],4,0),\"\")","v":0}]
["-","KN-009954","株式会社太洋マリーン","太洋マリーン",{"$f":"LENB(Suppliers[[#This Row],[省略名称（半角18,全角9文字以下）]])","v":12},"12VV",{"$f":"VLOOKUP(Suppliers[[#This Row],[支払条件コード]],PmtTerms[#All],2,0)","v":"月末〆６０日後払"},{"$f":"IFERROR(VLOOKUP(Suppliers[[#This Row],[支払条件コード]],PmtTerms[],3,0),\"\")","v":3},{"$f":"IFERROR(VLOOKUP(Suppliers[[#This Row],[支払条件コード]],PmtTerms[],4,0),\"\")","v":0}]
["-","KN-009955","株式会社新港木材工業所","新港木材工業所",{"$f":"LENB(Suppliers[[#This Row],[省略名称（半角18,全角9文字以下）]])","v":14},"12VV",{"$f":"VLOOKUP(Suppliers[[#This Row],[支払条件コード]],PmtTerms[#All],2,0)","v":"月末〆６０日後払"},{"$f":"IFERROR(VLOOKUP(Suppliers[[#This Row],[支払条件コード]],PmtTerms[],3,0),\"\")","v":3},{"$f":"IFERROR(VLOOKUP(Suppliers[[#This Row],[支払条件コード]],PmtTerms[],4,0),\"\")","v":0}]
["-","KN-009956","神港梱包株式会社","神港梱包",{"$f":"LENB(Suppliers[[#This Row],[省略名称（半角18,全角9文字以下）]])","v":8},"12VV",{"$f":"VLOOKUP(Suppliers[[#This Row],[支払条件コード]],PmtTerms[#All],2,0)","v":"月末〆６０日後払"},{"$f":"IFERROR(VLOOKUP(Suppliers[[#This Row],[支払条件コード]],PmtTerms[],3,0),\"\")","v":3},{"$f":"IFERROR(VLOOKUP(Suppliers[[#This Row],[支払条件コード]],PmtTerms[],4,0),\"\")","v":0}]
["-","KN-009965","日新エアポートサービス株式会社","日新ｴｱﾎﾟｰﾄｻｰﾋﾞｽ",{"$f":"LENB(Suppliers[[#This Row],[省略名称（半角18,全角9文字以下）]])","v":15},"12VV",{"$f":"VLOOKUP(Suppliers[[#This Row],[支払条件コード]],PmtTerms[#All],2,0)","v":"月末〆６０日後払"},{"$f":"IFERROR(VLOOKUP(Suppliers[[#This Row],[支払条件コード]],PmtTerms[],3,0),\"\")","v":3},{"$f":"IFERROR(VLOOKUP(Suppliers[[#This Row],[支払条件コード]],PmtTerms[],4,0),\"\")","v":0}]
["-","KN-009967","東雪運輸株式会社","東雪運輸",{"$f":"LENB(Suppliers[[#This Row],[省略名称（半角18,全角9文字以下）]])","v":8},"12VV",{"$f":"VLOOKUP(Suppliers[[#This Row],[支払条件コード]],PmtTerms[#All],2,0)","v":"月末〆６０日後払"},{"$f":"IFERROR(VLOOKUP(Suppliers[[#This Row],[支払条件コード]],PmtTerms[],3,0),\"\")","v":3},{"$f":"IFERROR(VLOOKUP(Suppliers[[#This Row],[支払条件コード]],PmtTerms[],4,0),\"\")","v":0}]
["-","KN-009970","株式会社滋賀日新","滋賀日新",{"$f":"LENB(Suppliers[[#This Row],[省略名称（半角18,全角9文字以下）]])","v":8},"12VV",{"$f":"VLOOKUP(Suppliers[[#This Row],[支払条件コード]],PmtTerms[#All],2,0)","v":"月末〆６０日後払"},{"$f":"IFERROR(VLOOKUP(Suppliers[[#This Row],[支払条件コード]],PmtTerms[],3,0),\"\")","v":3},{"$f":"IFERROR(VLOOKUP(Suppliers[[#This Row],[支払条件コード]],PmtTerms[],4,0),\"\")","v":0}]
["-","KN-009971","株式会社九州日新","九州日新",{"$f":"LENB(Suppliers[[#This Row],[省略名称（半角18,全角9文字以下）]])","v":8},"12VV",{"$f":"VLOOKUP(Suppliers[[#This Row],[支払条件コード]],PmtTerms[#All],2,0)","v":"月末〆６０日後払"},{"$f":"IFERROR(VLOOKUP(Suppliers[[#This Row],[支払条件コード]],PmtTerms[],3,0),\"\")","v":3},{"$f":"IFERROR(VLOOKUP(Suppliers[[#This Row],[支払条件コード]],PmtTerms[],4,0),\"\")","v":0}]
["-","KN-009972","新栄運輸株式会社","新栄運輸",{"$f":"LENB(Suppliers[[#This Row],[省略名称（半角18,全角9文字以下）]])","v":8},"12VV",{"$f":"VLOOKUP(Suppliers[[#This Row],[支払条件コード]],PmtTerms[#All],2,0)","v":"月末〆６０日後払"},{"$f":"IFERROR(VLOOKUP(Suppliers[[#This Row],[支払条件コード]],PmtTerms[],3,0),\"\")","v":3},{"$f":"IFERROR(VLOOKUP(Suppliers[[#This Row],[支払条件コード]],PmtTerms[],4,0),\"\")","v":0}]
["0000000010014","KN-010014","諸口","諸口",{"$f":"LENB(Suppliers[[#This Row],[省略名称（半角18,全角9文字以下）]])","v":4},"12VV",{"$f":"VLOOKUP(Suppliers[[#This Row],[支払条件コード]],PmtTerms[#All],2,0)","v":"月末〆６０日後払"},{"$f":"IFERROR(VLOOKUP(Suppliers[[#This Row],[支払条件コード]],PmtTerms[],3,0),\"\")","v":3},{"$f":"IFERROR(VLOOKUP(Suppliers[[#This Row],[支払条件コード]],PmtTerms[],4,0),\"\")","v":0}]
["0000000011300","KN-011300","月読企画(株)松製麺事業部","月読企画",{"$f":"LENB(Suppliers[[#This Row],[省略名称（半角18,全角9文字以下）]])","v":8},"0001",{"$f":"VLOOKUP(Suppliers[[#This Row],[支払条件コード]],PmtTerms[#All],2,0)","v":"計上後即時"},{"$f":"IFERROR(VLOOKUP(Suppliers[[#This Row],[支払条件コード]],PmtTerms[],3,0),\"\")","v":0},{"$f":"IFERROR(VLOOKUP(Suppliers[[#This Row],[支払条件コード]],PmtTerms[],4,0),\"\")","v":0}]
["0000000011314","KN-011314","㈲山長商店","山長商店",{"$f":"LENB(Suppliers[[#This Row],[省略名称（半角18,全角9文字以下）]])","v":8},"11VK",{"$f":"VLOOKUP(Suppliers[[#This Row],[支払条件コード]],PmtTerms[#All],2,0)","v":"月末〆２０日後払"},{"$f":"IFERROR(VLOOKUP(Suppliers[[#This Row],[支払条件コード]],PmtTerms[],3,0),\"\")","v":1},{"$f":"IFERROR(VLOOKUP(Suppliers[[#This Row],[支払条件コード]],PmtTerms[],4,0),\"\")","v":20}]
["0000000011439","KN-011439","㈱メイン","メイン",{"$f":"LENB(Suppliers[[#This Row],[省略名称（半角18,全角9文字以下）]])","v":6},"11F5",{"$f":"VLOOKUP(Suppliers[[#This Row],[支払条件コード]],PmtTerms[#All],2,0)","v":"１５日〆２０日後払"},{"$f":"IFERROR(VLOOKUP(Suppliers[[#This Row],[支払条件コード]],PmtTerms[],3,0),\"\")","v":1},{"$f":"IFERROR(VLOOKUP(Suppliers[[#This Row],[支払条件コード]],PmtTerms[],4,0),\"\")","v":5}]
["0000000011635","KN-011635","㈲かじや製麺","かじや製麺",{"$f":"LENB(Suppliers[[#This Row],[省略名称（半角18,全角9文字以下）]])","v":10},"11VV",{"$f":"VLOOKUP(Suppliers[[#This Row],[支払条件コード]],PmtTerms[#All],2,0)","v":"月末〆３０日後払"},{"$f":"IFERROR(VLOOKUP(Suppliers[[#This Row],[支払条件コード]],PmtTerms[],3,0),\"\")","v":2},{"$f":"IFERROR(VLOOKUP(Suppliers[[#This Row],[支払条件コード]],PmtTerms[],4,0),\"\")","v":0}]
["0000000011789","KN-011789","㈱IZUMIYA","IZUMIYA",{"$f":"LENB(Suppliers[[#This Row],[省略名称（半角18,全角9文字以下）]])","v":7},"11VV",{"$f":"VLOOKUP(Suppliers[[#This Row],[支払条件コード]],PmtTerms[#All],2,0)","v":"月末〆３０日後払"},{"$f":"IFERROR(VLOOKUP(Suppliers[[#This Row],[支払条件コード]],PmtTerms[],3,0),\"\")","v":2},{"$f":"IFERROR(VLOOKUP(Suppliers[[#This Row],[支払条件コード]],PmtTerms[],4,0),\"\")","v":0}]
["0000000011901","KN-011901","公益財団法人矯正協会","矯正協会",{"$f":"LENB(Suppliers[[#This Row],[省略名称（半角18,全角9文字以下）]])","v":8},"11VV",{"$f":"VLOOKUP(Suppliers[[#This Row],[支払条件コード]],PmtTerms[#All],2,0)","v":"月末〆３０日後払"},{"$f":"IFERROR(VLOOKUP(Suppliers[[#This Row],[支払条件コード]],PmtTerms[],3,0),\"\")","v":2},{"$f":"IFERROR(VLOOKUP(Suppliers[[#This Row],[支払条件コード]],PmtTerms[],4,0),\"\")","v":0}]
["0000000012021","KN-012021","平安","平安",{"$f":"LENB(Suppliers[[#This Row],[省略名称（半角18,全角9文字以下）]])","v":4},"0001",{"$f":"VLOOKUP(Suppliers[[#This Row],[支払条件コード]],PmtTerms[#All],2,0)","v":"計上後即時"},{"$f":"IFERROR(VLOOKUP(Suppliers[[#This Row],[支払条件コード]],PmtTerms[],3,0),\"\")","v":0},{"$f":"IFERROR(VLOOKUP(Suppliers[[#This Row],[支払条件コード]],PmtTerms[],4,0),\"\")","v":0}]
["0000000012061","KN-012061","平安（芹が谷）","平安（芹が谷）",{"$f":"LENB(Suppliers[[#This Row],[省略名称（半角18,全角9文字以下）]])","v":14},"0001",{"$f":"VLOOKUP(Suppliers[[#This Row],[支払条件コード]],PmtTerms[#All],2,0)","v":"計上後即時"},{"$f":"IFERROR(VLOOKUP(Suppliers[[#This Row],[支払条件コード]],PmtTerms[],3,0),\"\")","v":0},{"$f":"IFERROR(VLOOKUP(Suppliers[[#This Row],[支払条件コード]],PmtTerms[],4,0),\"\")","v":0}]
["0000000015000","KN-015000","ｴｺﾓ","ｴｺﾓ",{"$f":"LENB(Suppliers[[#This Row],[省略名称（半角18,全角9文字以下）]])","v":3},"13V5",{"$f":"VLOOKUP(Suppliers[[#This Row],[支払条件コード]],PmtTerms[#All],2,0)","v":"月末〆６５日後払"},{"$f":"IFERROR(VLOOKUP(Suppliers[[#This Row],[支払条件コード]],PmtTerms[],3,0),\"\")","v":3},{"$f":"IFERROR(VLOOKUP(Suppliers[[#This Row],[支払条件コード]],PmtTerms[],4,0),\"\")","v":5}]
["0000000016561","KN-016561","㈲永利食品","永利食品",{"$f":"LENB(Suppliers[[#This Row],[省略名称（半角18,全角9文字以下）]])","v":8},"11VK",{"$f":"VLOOKUP(Suppliers[[#This Row],[支払条件コード]],PmtTerms[#All],2,0)","v":"月末〆２０日後払"},{"$f":"IFERROR(VLOOKUP(Suppliers[[#This Row],[支払条件コード]],PmtTerms[],3,0),\"\")","v":1},{"$f":"IFERROR(VLOOKUP(Suppliers[[#This Row],[支払条件コード]],PmtTerms[],4,0),\"\")","v":20}]
["0000000016722","KN-016722","東洋水産㈱　資材部","東洋水産(資材部)",{"$f":"LENB(Suppliers[[#This Row],[省略名称（半角18,全角9文字以下）]])","v":16},"12VV",{"$f":"VLOOKUP(Suppliers[[#This Row],[支払条件コード]],PmtTerms[#All],2,0)","v":"月末〆６０日後払"},{"$f":"IFERROR(VLOOKUP(Suppliers[[#This Row],[支払条件コード]],PmtTerms[],3,0),\"\")","v":3},{"$f":"IFERROR(VLOOKUP(Suppliers[[#This Row],[支払条件コード]],PmtTerms[],4,0),\"\")","v":0}]
["0000000019011","KN-019011","かちどき製粉㈱","かちどき製粉",{"$f":"LENB(Suppliers[[#This Row],[省略名称（半角18,全角9文字以下）]])","v":12},"11VV",{"$f":"VLOOKUP(Suppliers[[#This Row],[支払条件コード]],PmtTerms[#All],2,0)","v":"月末〆３０日後払"},{"$f":"IFERROR(VLOOKUP(Suppliers[[#This Row],[支払条件コード]],PmtTerms[],3,0),\"\")","v":2},{"$f":"IFERROR(VLOOKUP(Suppliers[[#This Row],[支払条件コード]],PmtTerms[],4,0),\"\")","v":0}]
["0000000019042","KN-019042","千葉製粉㈱","千葉製粉",{"$f":"LENB(Suppliers[[#This Row],[省略名称（半角18,全角9文字以下）]])","v":8},"11VV",{"$f":"VLOOKUP(Suppliers[[#This Row],[支払条件コード]],PmtTerms[#All],2,0)","v":"月末〆３０日後払"},{"$f":"IFERROR(VLOOKUP(Suppliers[[#This Row],[支払条件コード]],PmtTerms[],3,0),\"\")","v":2},{"$f":"IFERROR(VLOOKUP(Suppliers[[#This Row],[支払条件コード]],PmtTerms[],4,0),\"\")","v":0}]
["0000000019045","KN-019045","千葉製粉㈱","千葉製粉",{"$f":"LENB(Suppliers[[#This Row],[省略名称（半角18,全角9文字以下）]])","v":8},"11VV",{"$f":"VLOOKUP(Suppliers[[#This Row],[支払条件コード]],PmtTerms[#All],2,0)","v":"月末〆３０日後払"},{"$f":"IFERROR(VLOOKUP(Suppliers[[#This Row],[支払条件コード]],PmtTerms[],3,0),\"\")","v":2},{"$f":"IFERROR(VLOOKUP(Suppliers[[#This Row],[支払条件コード]],PmtTerms[],4,0),\"\")","v":0}]
["0000000019080","KN-019080","大村庵","大村庵",{"$f":"LENB(Suppliers[[#This Row],[省略名称（半角18,全角9文字以下）]])","v":6},"0001",{"$f":"VLOOKUP(Suppliers[[#This Row],[支払条件コード]],PmtTerms[#All],2,0)","v":"計上後即時"},{"$f":"IFERROR(VLOOKUP(Suppliers[[#This Row],[支払条件コード]],PmtTerms[],3,0),\"\")","v":0},{"$f":"IFERROR(VLOOKUP(Suppliers[[#This Row],[支払条件コード]],PmtTerms[],4,0),\"\")","v":0}]
["0000000019219","KN-019219","ＪＡ全農かながわ秦野","JA全農かながわ秦野",{"$f":"LENB(Suppliers[[#This Row],[省略名称（半角18,全角9文字以下）]])","v":18},"11VV",{"$f":"VLOOKUP(Suppliers[[#This Row],[支払条件コード]],PmtTerms[#All],2,0)","v":"月末〆３０日後払"},{"$f":"IFERROR(VLOOKUP(Suppliers[[#This Row],[支払条件コード]],PmtTerms[],3,0),\"\")","v":2},{"$f":"IFERROR(VLOOKUP(Suppliers[[#This Row],[支払条件コード]],PmtTerms[],4,0),\"\")","v":0}]
["0000000019462","KN-019462","㈲いわた","いわた",{"$f":"LENB(Suppliers[[#This Row],[省略名称（半角18,全角9文字以下）]])","v":6},"12VP",{"$f":"VLOOKUP(Suppliers[[#This Row],[支払条件コード]],PmtTerms[#All],2,0)","v":"月末〆５５日後払"},{"$f":"IFERROR(VLOOKUP(Suppliers[[#This Row],[支払条件コード]],PmtTerms[],3,0),\"\")","v":2},{"$f":"IFERROR(VLOOKUP(Suppliers[[#This Row],[支払条件コード]],PmtTerms[],4,0),\"\")","v":25}]
["0000000019745","KN-019745","ﾌﾗｲｽﾀｰ㈱東海工場","ﾌﾗｲｽﾀｰ東海工場",{"$f":"LENB(Suppliers[[#This Row],[省略名称（半角18,全角9文字以下）]])","v":14},"13VF",{"$f":"VLOOKUP(Suppliers[[#This Row],[支払条件コード]],PmtTerms[#All],2,0)","v":"月末〆７５日後払"},{"$f":"IFERROR(VLOOKUP(Suppliers[[#This Row],[支払条件コード]],PmtTerms[],3,0),\"\")","v":3},{"$f":"IFERROR(VLOOKUP(Suppliers[[#This Row],[支払条件コード]],PmtTerms[],4,0),\"\")","v":15}]
["0000000021205","KN-021205","㈲南部山八","南部山八",{"$f":"LENB(Suppliers[[#This Row],[省略名称（半角18,全角9文字以下）]])","v":8},"11VP",{"$f":"VLOOKUP(Suppliers[[#This Row],[支払条件コード]],PmtTerms[#All],2,0)","v":"月末〆２５日後払"},{"$f":"IFERROR(VLOOKUP(Suppliers[[#This Row],[支払条件コード]],PmtTerms[],3,0),\"\")","v":1},{"$f":"IFERROR(VLOOKUP(Suppliers[[#This Row],[支払条件コード]],PmtTerms[],4,0),\"\")","v":25}]
["0000000021502","KN-021502","横浜ﾍﾞﾝﾀﾞｰ","横浜ﾍﾞﾝﾀﾞｰ",{"$f":"LENB(Suppliers[[#This Row],[省略名称（半角18,全角9文字以下）]])","v":10},"11VV",{"$f":"VLOOKUP(Suppliers[[#This Row],[支払条件コード]],PmtTerms[#All],2,0)","v":"月末〆３０日後払"},{"$f":"IFERROR(VLOOKUP(Suppliers[[#This Row],[支払条件コード]],PmtTerms[],3,0),\"\")","v":2},{"$f":"IFERROR(VLOOKUP(Suppliers[[#This Row],[支払条件コード]],PmtTerms[],4,0),\"\")","v":0}]
["0000000021557","KN-021557","㈱新晃食品","新晃食品",{"$f":"LENB(Suppliers[[#This Row],[省略名称（半角18,全角9文字以下）]])","v":8},"11VV",{"$f":"VLOOKUP(Suppliers[[#This Row],[支払条件コード]],PmtTerms[#All],2,0)","v":"月末〆３０日後払"},{"$f":"IFERROR(VLOOKUP(Suppliers[[#This Row],[支払条件コード]],PmtTerms[],3,0),\"\")","v":2},{"$f":"IFERROR(VLOOKUP(Suppliers[[#This Row],[支払条件コード]],PmtTerms[],4,0),\"\")","v":0}]
["0000000021854","KN-021854","㈲山一商店","山一商店",{"$f":"LENB(Suppliers[[#This Row],[省略名称（半角18,全角9文字以下）]])","v":8},"12VV",{"$f":"VLOOKUP(Suppliers[[#This Row],[支払条件コード]],PmtTerms[#All],2,0)","v":"月末〆６０日後払"},{"$f":"IFERROR(VLOOKUP(Suppliers[[#This Row],[支払条件コード]],PmtTerms[],3,0),\"\")","v":3},{"$f":"IFERROR(VLOOKUP(Suppliers[[#This Row],[支払条件コード]],PmtTerms[],4,0),\"\")","v":0}]
["0000000023065","KN-023065","㈲丸十早川ベーカリー","丸十早川ベーカリー",{"$f":"LENB(Suppliers[[#This Row],[省略名称（半角18,全角9文字以下）]])","v":18},"11VV",{"$f":"VLOOKUP(Suppliers[[#This Row],[支払条件コード]],PmtTerms[#All],2,0)","v":"月末〆３０日後払"},{"$f":"IFERROR(VLOOKUP(Suppliers[[#This Row],[支払条件コード]],PmtTerms[],3,0),\"\")","v":2},{"$f":"IFERROR(VLOOKUP(Suppliers[[#This Row],[支払条件コード]],PmtTerms[],4,0),\"\")","v":0}]
["0000000026301","KN-026301","神奈川県学校給食会","神奈川県学校給食会",{"$f":"LENB(Suppliers[[#This Row],[省略名称（半角18,全角9文字以下）]])","v":18},"11VV",{"$f":"VLOOKUP(Suppliers[[#This Row],[支払条件コード]],PmtTerms[#All],2,0)","v":"月末〆３０日後払"},{"$f":"IFERROR(VLOOKUP(Suppliers[[#This Row],[支払条件コード]],PmtTerms[],3,0),\"\")","v":2},{"$f":"IFERROR(VLOOKUP(Suppliers[[#This Row],[支払条件コード]],PmtTerms[],4,0),\"\")","v":0}]
["0000000026408","KN-026408","玉木屋製麺所","玉木屋製麺所",{"$f":"LENB(Suppliers[[#This Row],[省略名称（半角18,全角9文字以下）]])","v":12},"11VK",{"$f":"VLOOKUP(Suppliers[[#This Row],[支払条件コード]],PmtTerms[#All],2,0)","v":"月末〆２０日後払"},{"$f":"IFERROR(VLOOKUP(Suppliers[[#This Row],[支払条件コード]],PmtTerms[],3,0),\"\")","v":1},{"$f":"IFERROR(VLOOKUP(Suppliers[[#This Row],[支払条件コード]],PmtTerms[],4,0),\"\")","v":20}]
["0000000026606","KN-026606","㈲大黒屋製麺所","大黒屋製麺所",{"$f":"LENB(Suppliers[[#This Row],[省略名称（半角18,全角9文字以下）]])","v":12},"12V5",{"$f":"VLOOKUP(Suppliers[[#This Row],[支払条件コード]],PmtTerms[#All],2,0)","v":"月末〆３５日後払"},{"$f":"IFERROR(VLOOKUP(Suppliers[[#This Row],[支払条件コード]],PmtTerms[],3,0),\"\")","v":2},{"$f":"IFERROR(VLOOKUP(Suppliers[[#This Row],[支払条件コード]],PmtTerms[],4,0),\"\")","v":5}]
["0000000026736","KN-026736","方製麺所","方製麺所",{"$f":"LENB(Suppliers[[#This Row],[省略名称（半角18,全角9文字以下）]])","v":8},"11VV",{"$f":"VLOOKUP(Suppliers[[#This Row],[支払条件コード]],PmtTerms[#All],2,0)","v":"月末〆３０日後払"},{"$f":"IFERROR(VLOOKUP(Suppliers[[#This Row],[支払条件コード]],PmtTerms[],3,0),\"\")","v":2},{"$f":"IFERROR(VLOOKUP(Suppliers[[#This Row],[支払条件コード]],PmtTerms[],4,0),\"\")","v":0}]
["0000000026743","KN-026743","潘製麺所","潘製麺所",{"$f":"LENB(Suppliers[[#This Row],[省略名称（半角18,全角9文字以下）]])","v":8},"11VP",{"$f":"VLOOKUP(Suppliers[[#This Row],[支払条件コード]],PmtTerms[#All],2,0)","v":"月末〆２５日後払"},{"$f":"IFERROR(VLOOKUP(Suppliers[[#This Row],[支払条件コード]],PmtTerms[],3,0),\"\")","v":1},{"$f":"IFERROR(VLOOKUP(Suppliers[[#This Row],[支払条件コード]],PmtTerms[],4,0),\"\")","v":25}]
["0000000026798","KN-026798","㈲長島食品","長島食品",{"$f":"LENB(Suppliers[[#This Row],[省略名称（半角18,全角9文字以下）]])","v":8},"12VK",{"$f":"VLOOKUP(Suppliers[[#This Row],[支払条件コード]],PmtTerms[#All],2,0)","v":"月末〆５０日後払"},{"$f":"IFERROR(VLOOKUP(Suppliers[[#This Row],[支払条件コード]],PmtTerms[],3,0),\"\")","v":2},{"$f":"IFERROR(VLOOKUP(Suppliers[[#This Row],[支払条件コード]],PmtTerms[],4,0),\"\")","v":20}]
["0000000026801","KN-026801","奥住製麺所","奥住製麺所",{"$f":"LENB(Suppliers[[#This Row],[省略名称（半角18,全角9文字以下）]])","v":10},"11VV",{"$f":"VLOOKUP(Suppliers[[#This Row],[支払条件コード]],PmtTerms[#All],2,0)","v":"月末〆３０日後払"},{"$f":"IFERROR(VLOOKUP(Suppliers[[#This Row],[支払条件コード]],PmtTerms[],3,0),\"\")","v":2},{"$f":"IFERROR(VLOOKUP(Suppliers[[#This Row],[支払条件コード]],PmtTerms[],4,0),\"\")","v":0}]
["0000000026851","KN-026851","㈲津南麺業","津南麺業",{"$f":"LENB(Suppliers[[#This Row],[省略名称（半角18,全角9文字以下）]])","v":8},"12VK",{"$f":"VLOOKUP(Suppliers[[#This Row],[支払条件コード]],PmtTerms[#All],2,0)","v":"月末〆５０日後払"},{"$f":"IFERROR(VLOOKUP(Suppliers[[#This Row],[支払条件コード]],PmtTerms[],3,0),\"\")","v":2},{"$f":"IFERROR(VLOOKUP(Suppliers[[#This Row],[支払条件コード]],PmtTerms[],4,0),\"\")","v":20}]
["0000000026903","KN-026903","㈲星川製麺","星川製麺",{"$f":"LENB(Suppliers[[#This Row],[省略名称（半角18,全角9文字以下）]])","v":8},"12V5",{"$f":"VLOOKUP(Suppliers[[#This Row],[支払条件コード]],PmtTerms[#All],2,0)","v":"月末〆３５日後払"},{"$f":"IFERROR(VLOOKUP(Suppliers[[#This Row],[支払条件コード]],PmtTerms[],3,0),\"\")","v":2},{"$f":"IFERROR(VLOOKUP(Suppliers[[#This Row],[支払条件コード]],PmtTerms[],4,0),\"\")","v":5}]
["0000000029063","KN-029063","新月","新月",{"$f":"LENB(Suppliers[[#This Row],[省略名称（半角18,全角9文字以下）]])","v":4},"11VA",{"$f":"VLOOKUP(Suppliers[[#This Row],[支払条件コード]],PmtTerms[#All],2,0)","v":"月末〆１０日後払"},{"$f":"IFERROR(VLOOKUP(Suppliers[[#This Row],[支払条件コード]],PmtTerms[],3,0),\"\")","v":1},{"$f":"IFERROR(VLOOKUP(Suppliers[[#This Row],[支払条件コード]],PmtTerms[],4,0),\"\")","v":10}]
["0000000029766","KN-029766","㈱栃木屋惣菜店","栃木屋惣菜店",{"$f":"LENB(Suppliers[[#This Row],[省略名称（半角18,全角9文字以下）]])","v":12},"11VF",{"$f":"VLOOKUP(Suppliers[[#This Row],[支払条件コード]],PmtTerms[#All],2,0)","v":"月末〆１５日後払"},{"$f":"IFERROR(VLOOKUP(Suppliers[[#This Row],[支払条件コード]],PmtTerms[],3,0),\"\")","v":1},{"$f":"IFERROR(VLOOKUP(Suppliers[[#This Row],[支払条件コード]],PmtTerms[],4,0),\"\")","v":15}]
["0000000031028","KN-031028","㈱桔梗屋","桔梗屋",{"$f":"LENB(Suppliers[[#This Row],[省略名称（半角18,全角9文字以下）]])","v":6},"0001",{"$f":"VLOOKUP(Suppliers[[#This Row],[支払条件コード]],PmtTerms[#All],2,0)","v":"計上後即時"},{"$f":"IFERROR(VLOOKUP(Suppliers[[#This Row],[支払条件コード]],PmtTerms[],3,0),\"\")","v":0},{"$f":"IFERROR(VLOOKUP(Suppliers[[#This Row],[支払条件コード]],PmtTerms[],4,0),\"\")","v":0}]
["0000000031776","KN-031776","㈲村田商店","村田商店",{"$f":"LENB(Suppliers[[#This Row],[省略名称（半角18,全角9文字以下）]])","v":8},"11VK",{"$f":"VLOOKUP(Suppliers[[#This Row],[支払条件コード]],PmtTerms[#All],2,0)","v":"月末〆２０日後払"},{"$f":"IFERROR(VLOOKUP(Suppliers[[#This Row],[支払条件コード]],PmtTerms[],3,0),\"\")","v":1},{"$f":"IFERROR(VLOOKUP(Suppliers[[#This Row],[支払条件コード]],PmtTerms[],4,0),\"\")","v":20}]
["0000000031806","KN-031806","神奈川農産工業㈱","神奈川農産工業",{"$f":"LENB(Suppliers[[#This Row],[省略名称（半角18,全角9文字以下）]])","v":14},"12V5",{"$f":"VLOOKUP(Suppliers[[#This Row],[支払条件コード]],PmtTerms[#All],2,0)","v":"月末〆３５日後払"},{"$f":"IFERROR(VLOOKUP(Suppliers[[#This Row],[支払条件コード]],PmtTerms[],3,0),\"\")","v":2},{"$f":"IFERROR(VLOOKUP(Suppliers[[#This Row],[支払条件コード]],PmtTerms[],4,0),\"\")","v":5}]
["0000000031868","KN-031868","㈲安室商店","安室商店",{"$f":"LENB(Suppliers[[#This Row],[省略名称（半角18,全角9文字以下）]])","v":8},"11VK",{"$f":"VLOOKUP(Suppliers[[#This Row],[支払条件コード]],PmtTerms[#All],2,0)","v":"月末〆２０日後払"},{"$f":"IFERROR(VLOOKUP(Suppliers[[#This Row],[支払条件コード]],PmtTerms[],3,0),\"\")","v":1},{"$f":"IFERROR(VLOOKUP(Suppliers[[#This Row],[支払条件コード]],PmtTerms[],4,0),\"\")","v":20}]
["0000000031929","KN-031929","㈲金八米店","金八米店",{"$f":"LENB(Suppliers[[#This Row],[省略名称（半角18,全角9文字以下）]])","v":8},"0001",{"$f":"VLOOKUP(Suppliers[[#This Row],[支払条件コード]],PmtTerms[#All],2,0)","v":"計上後即時"},{"$f":"IFERROR(VLOOKUP(Suppliers[[#This Row],[支払条件コード]],PmtTerms[],3,0),\"\")","v":0},{"$f":"IFERROR(VLOOKUP(Suppliers[[#This Row],[支払条件コード]],PmtTerms[],4,0),\"\")","v":0}]
["0000000031936","KN-031936","鈴木米店","鈴木米店",{"$f":"LENB(Suppliers[[#This Row],[省略名称（半角18,全角9文字以下）]])","v":8},"0001",{"$f":"VLOOKUP(Suppliers[[#This Row],[支払条件コード]],PmtTerms[#All],2,0)","v":"計上後即時"},{"$f":"IFERROR(VLOOKUP(Suppliers[[#This Row],[支払条件コード]],PmtTerms[],3,0),\"\")","v":0},{"$f":"IFERROR(VLOOKUP(Suppliers[[#This Row],[支払条件コード]],PmtTerms[],4,0),\"\")","v":0}]
["0000000033819","KN-033819","（資）セデリカ","セデリカ",{"$f":"LENB(Suppliers[[#This Row],[省略名称（半角18,全角9文字以下）]])","v":8},"11VA",{"$f":"VLOOKUP(Suppliers[[#This Row],[支払条件コード]],PmtTerms[#All],2,0)","v":"月末〆１０日後払"},{"$f":"IFERROR(VLOOKUP(Suppliers[[#This Row],[支払条件コード]],PmtTerms[],3,0),\"\")","v":1},{"$f":"IFERROR(VLOOKUP(Suppliers[[#This Row],[支払条件コード]],PmtTerms[],4,0),\"\")","v":10}]
["0000000036023","KN-036023","㈲満寿屋　本郷町","満寿屋　本郷町",{"$f":"LENB(Suppliers[[#This Row],[省略名称（半角18,全角9文字以下）]])","v":14},"11VV",{"$f":"VLOOKUP(Suppliers[[#This Row],[支払条件コード]],PmtTerms[#All],2,0)","v":"月末〆３０日後払"},{"$f":"IFERROR(VLOOKUP(Suppliers[[#This Row],[支払条件コード]],PmtTerms[],3,0),\"\")","v":2},{"$f":"IFERROR(VLOOKUP(Suppliers[[#This Row],[支払条件コード]],PmtTerms[],4,0),\"\")","v":0}]
["0000000036047","KN-036047","運ど運屋","運ど運屋",{"$f":"LENB(Suppliers[[#This Row],[省略名称（半角18,全角9文字以下）]])","v":8},"11VP",{"$f":"VLOOKUP(Suppliers[[#This Row],[支払条件コード]],PmtTerms[#All],2,0)","v":"月末〆２５日後払"},{"$f":"IFERROR(VLOOKUP(Suppliers[[#This Row],[支払条件コード]],PmtTerms[],3,0),\"\")","v":1},{"$f":"IFERROR(VLOOKUP(Suppliers[[#This Row],[支払条件コード]],PmtTerms[],4,0),\"\")","v":25}]
["0000000036100","KN-036100","㈱横浜ワンタン本舗","横浜ワンタン本舗",{"$f":"LENB(Suppliers[[#This Row],[省略名称（半角18,全角9文字以下）]])","v":16},"11VV",{"$f":"VLOOKUP(Suppliers[[#This Row],[支払条件コード]],PmtTerms[#All],2,0)","v":"月末〆３０日後払"},{"$f":"IFERROR(VLOOKUP(Suppliers[[#This Row],[支払条件コード]],PmtTerms[],3,0),\"\")","v":2},{"$f":"IFERROR(VLOOKUP(Suppliers[[#This Row],[支払条件コード]],PmtTerms[],4,0),\"\")","v":0}]
["0000000036120","KN-036120","㈲布施食品","布施食品",{"$f":"LENB(Suppliers[[#This Row],[省略名称（半角18,全角9文字以下）]])","v":8},"11VK",{"$f":"VLOOKUP(Suppliers[[#This Row],[支払条件コード]],PmtTerms[#All],2,0)","v":"月末〆２０日後払"},{"$f":"IFERROR(VLOOKUP(Suppliers[[#This Row],[支払条件コード]],PmtTerms[],3,0),\"\")","v":1},{"$f":"IFERROR(VLOOKUP(Suppliers[[#This Row],[支払条件コード]],PmtTerms[],4,0),\"\")","v":20}]
["0000000036184","KN-036184","㈱丸紀","丸紀",{"$f":"LENB(Suppliers[[#This Row],[省略名称（半角18,全角9文字以下）]])","v":4},"13V5",{"$f":"VLOOKUP(Suppliers[[#This Row],[支払条件コード]],PmtTerms[#All],2,0)","v":"月末〆６５日後払"},{"$f":"IFERROR(VLOOKUP(Suppliers[[#This Row],[支払条件コード]],PmtTerms[],3,0),\"\")","v":3},{"$f":"IFERROR(VLOOKUP(Suppliers[[#This Row],[支払条件コード]],PmtTerms[],4,0),\"\")","v":5}]
["0000000036200","KN-036200","志な乃","志な乃",{"$f":"LENB(Suppliers[[#This Row],[省略名称（半角18,全角9文字以下）]])","v":6},"0001",{"$f":"VLOOKUP(Suppliers[[#This Row],[支払条件コード]],PmtTerms[#All],2,0)","v":"計上後即時"},{"$f":"IFERROR(VLOOKUP(Suppliers[[#This Row],[支払条件コード]],PmtTerms[],3,0),\"\")","v":0},{"$f":"IFERROR(VLOOKUP(Suppliers[[#This Row],[支払条件コード]],PmtTerms[],4,0),\"\")","v":0}]
["0000000036301","KN-036301","㈲追浜製麺","追浜製麺",{"$f":"LENB(Suppliers[[#This Row],[省略名称（半角18,全角9文字以下）]])","v":8},"11VK",{"$f":"VLOOKUP(Suppliers[[#This Row],[支払条件コード]],PmtTerms[#All],2,0)","v":"月末〆２０日後払"},{"$f":"IFERROR(VLOOKUP(Suppliers[[#This Row],[支払条件コード]],PmtTerms[],3,0),\"\")","v":1},{"$f":"IFERROR(VLOOKUP(Suppliers[[#This Row],[支払条件コード]],PmtTerms[],4,0),\"\")","v":20}]
["0000000036757","KN-036757","（かなえ）村山食品㈲","（かなえ）村山食品",{"$f":"LENB(Suppliers[[#This Row],[省略名称（半角18,全角9文字以下）]])","v":18},"11VV",{"$f":"VLOOKUP(Suppliers[[#This Row],[支払条件コード]],PmtTerms[#All],2,0)","v":"月末〆３０日後払"},{"$f":"IFERROR(VLOOKUP(Suppliers[[#This Row],[支払条件コード]],PmtTerms[],3,0),\"\")","v":2},{"$f":"IFERROR(VLOOKUP(Suppliers[[#This Row],[支払条件コード]],PmtTerms[],4,0),\"\")","v":0}]
["0000000036764","KN-036764","㈲関戸製麺食品店","関戸製麺食品店",{"$f":"LENB(Suppliers[[#This Row],[省略名称（半角18,全角9文字以下）]])","v":14},"11VP",{"$f":"VLOOKUP(Suppliers[[#This Row],[支払条件コード]],PmtTerms[#All],2,0)","v":"月末〆２５日後払"},{"$f":"IFERROR(VLOOKUP(Suppliers[[#This Row],[支払条件コード]],PmtTerms[],3,0),\"\")","v":1},{"$f":"IFERROR(VLOOKUP(Suppliers[[#This Row],[支払条件コード]],PmtTerms[],4,0),\"\")","v":25}]
["0000000036800","KN-036800","㈲布施製麺所","布施製麺所",{"$f":"LENB(Suppliers[[#This Row],[省略名称（半角18,全角9文字以下）]])","v":10},"11VP",{"$f":"VLOOKUP(Suppliers[[#This Row],[支払条件コード]],PmtTerms[#All],2,0)","v":"月末〆２５日後払"},{"$f":"IFERROR(VLOOKUP(Suppliers[[#This Row],[支払条件コード]],PmtTerms[],3,0),\"\")","v":1},{"$f":"IFERROR(VLOOKUP(Suppliers[[#This Row],[支払条件コード]],PmtTerms[],4,0),\"\")","v":25}]
["0000000036955","KN-036955","横浜市麺業協同組合","横浜市麺業協同組合",{"$f":"LENB(Suppliers[[#This Row],[省略名称（半角18,全角9文字以下）]])","v":18},"11VV",{"$f":"VLOOKUP(Suppliers[[#This Row],[支払条件コード]],PmtTerms[#All],2,0)","v":"月末〆３０日後払"},{"$f":"IFERROR(VLOOKUP(Suppliers[[#This Row],[支払条件コード]],PmtTerms[],3,0),\"\")","v":2},{"$f":"IFERROR(VLOOKUP(Suppliers[[#This Row],[支払条件コード]],PmtTerms[],4,0),\"\")","v":0}]
["0000000041148","KN-041148","㈲丸三せきもと","丸三せきもと",{"$f":"LENB(Suppliers[[#This Row],[省略名称（半角18,全角9文字以下）]])","v":12},"12VP",{"$f":"VLOOKUP(Suppliers[[#This Row],[支払条件コード]],PmtTerms[#All],2,0)","v":"月末〆５５日後払"},{"$f":"IFERROR(VLOOKUP(Suppliers[[#This Row],[支払条件コード]],PmtTerms[],3,0),\"\")","v":2},{"$f":"IFERROR(VLOOKUP(Suppliers[[#This Row],[支払条件コード]],PmtTerms[],4,0),\"\")","v":25}]
["0000000041155","KN-041155","㈱重一商事","重一商事",{"$f":"LENB(Suppliers[[#This Row],[省略名称（半角18,全角9文字以下）]])","v":8},"11VV",{"$f":"VLOOKUP(Suppliers[[#This Row],[支払条件コード]],PmtTerms[#All],2,0)","v":"月末〆３０日後払"},{"$f":"IFERROR(VLOOKUP(Suppliers[[#This Row],[支払条件コード]],PmtTerms[],3,0),\"\")","v":2},{"$f":"IFERROR(VLOOKUP(Suppliers[[#This Row],[支払条件コード]],PmtTerms[],4,0),\"\")","v":0}]
["0000000041160","KN-041160","ﾖｺﾊﾏﾄﾚｰﾃﾞｨﾝｸﾞ","ﾖｺﾊﾏﾄﾚｰﾃﾞｨﾝｸﾞ",{"$f":"LENB(Suppliers[[#This Row],[省略名称（半角18,全角9文字以下）]])","v":13},"11VV",{"$f":"VLOOKUP(Suppliers[[#This Row],[支払条件コード]],PmtTerms[#All],2,0)","v":"月末〆３０日後払"},{"$f":"IFERROR(VLOOKUP(Suppliers[[#This Row],[支払条件コード]],PmtTerms[],3,0),\"\")","v":2},{"$f":"IFERROR(VLOOKUP(Suppliers[[#This Row],[支払条件コード]],PmtTerms[],4,0),\"\")","v":0}]
["0000000041179","KN-041179","㈲丸大日野屋","丸大日野屋",{"$f":"LENB(Suppliers[[#This Row],[省略名称（半角18,全角9文字以下）]])","v":10},"11VV",{"$f":"VLOOKUP(Suppliers[[#This Row],[支払条件コード]],PmtTerms[#All],2,0)","v":"月末〆３０日後払"},{"$f":"IFERROR(VLOOKUP(Suppliers[[#This Row],[支払条件コード]],PmtTerms[],3,0),\"\")","v":2},{"$f":"IFERROR(VLOOKUP(Suppliers[[#This Row],[支払条件コード]],PmtTerms[],4,0),\"\")","v":0}]
["0000000041186","KN-041186","㈲カノウ","カノウ",{"$f":"LENB(Suppliers[[#This Row],[省略名称（半角18,全角9文字以下）]])","v":6},"12VV",{"$f":"VLOOKUP(Suppliers[[#This Row],[支払条件コード]],PmtTerms[#All],2,0)","v":"月末〆６０日後払"},{"$f":"IFERROR(VLOOKUP(Suppliers[[#This Row],[支払条件コード]],PmtTerms[],3,0),\"\")","v":3},{"$f":"IFERROR(VLOOKUP(Suppliers[[#This Row],[支払条件コード]],PmtTerms[],4,0),\"\")","v":0}]
["0000000041728","KN-041728","久津間製粉㈱","久津間製粉",{"$f":"LENB(Suppliers[[#This Row],[省略名称（半角18,全角9文字以下）]])","v":10},"12VK",{"$f":"VLOOKUP(Suppliers[[#This Row],[支払条件コード]],PmtTerms[#All],2,0)","v":"月末〆５０日後払"},{"$f":"IFERROR(VLOOKUP(Suppliers[[#This Row],[支払条件コード]],PmtTerms[],3,0),\"\")","v":2},{"$f":"IFERROR(VLOOKUP(Suppliers[[#This Row],[支払条件コード]],PmtTerms[],4,0),\"\")","v":20}]
["0000000041766","KN-041766","㈱榮村商店","榮村商店",{"$f":"LENB(Suppliers[[#This Row],[省略名称（半角18,全角9文字以下）]])","v":8},"12VV",{"$f":"VLOOKUP(Suppliers[[#This Row],[支払条件コード]],PmtTerms[#All],2,0)","v":"月末〆６０日後払"},{"$f":"IFERROR(VLOOKUP(Suppliers[[#This Row],[支払条件コード]],PmtTerms[],3,0),\"\")","v":3},{"$f":"IFERROR(VLOOKUP(Suppliers[[#This Row],[支払条件コード]],PmtTerms[],4,0),\"\")","v":0}]
["0000000041780","KN-041780","㈱鈴木屋","鈴木屋",{"$f":"LENB(Suppliers[[#This Row],[省略名称（半角18,全角9文字以下）]])","v":6},"12VV",{"$f":"VLOOKUP(Suppliers[[#This Row],[支払条件コード]],PmtTerms[#All],2,0)","v":"月末〆６０日後払"},{"$f":"IFERROR(VLOOKUP(Suppliers[[#This Row],[支払条件コード]],PmtTerms[],3,0),\"\")","v":3},{"$f":"IFERROR(VLOOKUP(Suppliers[[#This Row],[支払条件コード]],PmtTerms[],4,0),\"\")","v":0}]
["0000000041827","KN-041827","㈱さこう","さこう",{"$f":"LENB(Suppliers[[#This Row],[省略名称（半角18,全角9文字以下）]])","v":6},"12VV",{"$f":"VLOOKUP(Suppliers[[#This Row],[支払条件コード]],PmtTerms[#All],2,0)","v":"月末〆６０日後払"},{"$f":"IFERROR(VLOOKUP(Suppliers[[#This Row],[支払条件コード]],PmtTerms[],3,0),\"\")","v":3},{"$f":"IFERROR(VLOOKUP(Suppliers[[#This Row],[支払条件コード]],PmtTerms[],4,0),\"\")","v":0}]
["0000000041834","KN-041834","神栄物産㈱","神栄物産",{"$f":"LENB(Suppliers[[#This Row],[省略名称（半角18,全角9文字以下）]])","v":8},"12VF",{"$f":"VLOOKUP(Suppliers[[#This Row],[支払条件コード]],PmtTerms[#All],2,0)","v":"月末〆４５日後払"},{"$f":"IFERROR(VLOOKUP(Suppliers[[#This Row],[支払条件コード]],PmtTerms[],3,0),\"\")","v":2},{"$f":"IFERROR(VLOOKUP(Suppliers[[#This Row],[支払条件コード]],PmtTerms[],4,0),\"\")","v":15}]
["0000000041858","KN-041858","ライオン商事㈱","ライオン商事",{"$f":"LENB(Suppliers[[#This Row],[省略名称（半角18,全角9文字以下）]])","v":12},"0001",{"$f":"VLOOKUP(Suppliers[[#This Row],[支払条件コード]],PmtTerms[#All],2,0)","v":"計上後即時"},{"$f":"IFERROR(VLOOKUP(Suppliers[[#This Row],[支払条件コード]],PmtTerms[],3,0),\"\")","v":0},{"$f":"IFERROR(VLOOKUP(Suppliers[[#This Row],[支払条件コード]],PmtTerms[],4,0),\"\")","v":0}]
["0000000045720","KN-045720","大宝製麺㈱","大宝製麺",{"$f":"LENB(Suppliers[[#This Row],[省略名称（半角18,全角9文字以下）]])","v":8},"12VF",{"$f":"VLOOKUP(Suppliers[[#This Row],[支払条件コード]],PmtTerms[#All],2,0)","v":"月末〆４５日後払"},{"$f":"IFERROR(VLOOKUP(Suppliers[[#This Row],[支払条件コード]],PmtTerms[],3,0),\"\")","v":2},{"$f":"IFERROR(VLOOKUP(Suppliers[[#This Row],[支払条件コード]],PmtTerms[],4,0),\"\")","v":15}]
["0000000045881","KN-045881","大木製麺㈱","大木製麺",{"$f":"LENB(Suppliers[[#This Row],[省略名称（半角18,全角9文字以下）]])","v":8},"11VK",{"$f":"VLOOKUP(Suppliers[[#This Row],[支払条件コード]],PmtTerms[#All],2,0)","v":"月末〆２０日後払"},{"$f":"IFERROR(VLOOKUP(Suppliers[[#This Row],[支払条件コード]],PmtTerms[],3,0),\"\")","v":1},{"$f":"IFERROR(VLOOKUP(Suppliers[[#This Row],[支払条件コード]],PmtTerms[],4,0),\"\")","v":20}]
["0000000046105","KN-046105","㈱川島製麺所","川島製麺所",{"$f":"LENB(Suppliers[[#This Row],[省略名称（半角18,全角9文字以下）]])","v":10},"12VV",{"$f":"VLOOKUP(Suppliers[[#This Row],[支払条件コード]],PmtTerms[#All],2,0)","v":"月末〆６０日後払"},{"$f":"IFERROR(VLOOKUP(Suppliers[[#This Row],[支払条件コード]],PmtTerms[],3,0),\"\")","v":3},{"$f":"IFERROR(VLOOKUP(Suppliers[[#This Row],[支払条件コード]],PmtTerms[],4,0),\"\")","v":0}]
["0000000046161","KN-046161","横田製麺","横田製麺",{"$f":"LENB(Suppliers[[#This Row],[省略名称（半角18,全角9文字以下）]])","v":8},"11VV",{"$f":"VLOOKUP(Suppliers[[#This Row],[支払条件コード]],PmtTerms[#All],2,0)","v":"月末〆３０日後払"},{"$f":"IFERROR(VLOOKUP(Suppliers[[#This Row],[支払条件コード]],PmtTerms[],3,0),\"\")","v":2},{"$f":"IFERROR(VLOOKUP(Suppliers[[#This Row],[支払条件コード]],PmtTerms[],4,0),\"\")","v":0}]
["0000000046310","KN-046310","㈲マルキ製麺所","マルキ製麺所",{"$f":"LENB(Suppliers[[#This Row],[省略名称（半角18,全角9文字以下）]])","v":12},"11VF",{"$f":"VLOOKUP(Suppliers[[#This Row],[支払条件コード]],PmtTerms[#All],2,0)","v":"月末〆１５日後払"},{"$f":"IFERROR(VLOOKUP(Suppliers[[#This Row],[支払条件コード]],PmtTerms[],3,0),\"\")","v":1},{"$f":"IFERROR(VLOOKUP(Suppliers[[#This Row],[支払条件コード]],PmtTerms[],4,0),\"\")","v":15}]
["0000000046730","KN-046730","㈲熱海製麺","熱海製麺",{"$f":"LENB(Suppliers[[#This Row],[省略名称（半角18,全角9文字以下）]])","v":8},"12VK",{"$f":"VLOOKUP(Suppliers[[#This Row],[支払条件コード]],PmtTerms[#All],2,0)","v":"月末〆５０日後払"},{"$f":"IFERROR(VLOOKUP(Suppliers[[#This Row],[支払条件コード]],PmtTerms[],3,0),\"\")","v":2},{"$f":"IFERROR(VLOOKUP(Suppliers[[#This Row],[支払条件コード]],PmtTerms[],4,0),\"\")","v":20}]
["0000000046884","KN-046884","㈲杉産","杉産",{"$f":"LENB(Suppliers[[#This Row],[省略名称（半角18,全角9文字以下）]])","v":4},"11VV",{"$f":"VLOOKUP(Suppliers[[#This Row],[支払条件コード]],PmtTerms[#All],2,0)","v":"月末〆３０日後払"},{"$f":"IFERROR(VLOOKUP(Suppliers[[#This Row],[支払条件コード]],PmtTerms[],3,0),\"\")","v":2},{"$f":"IFERROR(VLOOKUP(Suppliers[[#This Row],[支払条件コード]],PmtTerms[],4,0),\"\")","v":0}]
["0000000046983","KN-046983","㈲長後庵","長後庵",{"$f":"LENB(Suppliers[[#This Row],[省略名称（半角18,全角9文字以下）]])","v":6},"11VP",{"$f":"VLOOKUP(Suppliers[[#This Row],[支払条件コード]],PmtTerms[#All],2,0)","v":"月末〆２５日後払"},{"$f":"IFERROR(VLOOKUP(Suppliers[[#This Row],[支払条件コード]],PmtTerms[],3,0),\"\")","v":1},{"$f":"IFERROR(VLOOKUP(Suppliers[[#This Row],[支払条件コード]],PmtTerms[],4,0),\"\")","v":25}]
["0000000046990","KN-046990","㈲相模屋製麺所","相模屋製麺所",{"$f":"LENB(Suppliers[[#This Row],[省略名称（半角18,全角9文字以下）]])","v":12},"11VV",{"$f":"VLOOKUP(Suppliers[[#This Row],[支払条件コード]],PmtTerms[#All],2,0)","v":"月末〆３０日後払"},{"$f":"IFERROR(VLOOKUP(Suppliers[[#This Row],[支払条件コード]],PmtTerms[],3,0),\"\")","v":2},{"$f":"IFERROR(VLOOKUP(Suppliers[[#This Row],[支払条件コード]],PmtTerms[],4,0),\"\")","v":0}]
["0000000047719","KN-047719","㈱久野屋","久野屋",{"$f":"LENB(Suppliers[[#This Row],[省略名称（半角18,全角9文字以下）]])","v":6},"12VV",{"$f":"VLOOKUP(Suppliers[[#This Row],[支払条件コード]],PmtTerms[#All],2,0)","v":"月末〆６０日後払"},{"$f":"IFERROR(VLOOKUP(Suppliers[[#This Row],[支払条件コード]],PmtTerms[],3,0),\"\")","v":3},{"$f":"IFERROR(VLOOKUP(Suppliers[[#This Row],[支払条件コード]],PmtTerms[],4,0),\"\")","v":0}]
["0000000047757","KN-047757","麺好み","麺好み",{"$f":"LENB(Suppliers[[#This Row],[省略名称（半角18,全角9文字以下）]])","v":6},"11VV",{"$f":"VLOOKUP(Suppliers[[#This Row],[支払条件コード]],PmtTerms[#All],2,0)","v":"月末〆３０日後払"},{"$f":"IFERROR(VLOOKUP(Suppliers[[#This Row],[支払条件コード]],PmtTerms[],3,0),\"\")","v":2},{"$f":"IFERROR(VLOOKUP(Suppliers[[#This Row],[支払条件コード]],PmtTerms[],4,0),\"\")","v":0}]
["0000000047955","KN-047955","㈲菅谷製麺所","菅谷製麺所",{"$f":"LENB(Suppliers[[#This Row],[省略名称（半角18,全角9文字以下）]])","v":10},"11VV",{"$f":"VLOOKUP(Suppliers[[#This Row],[支払条件コード]],PmtTerms[#All],2,0)","v":"月末〆３０日後払"},{"$f":"IFERROR(VLOOKUP(Suppliers[[#This Row],[支払条件コード]],PmtTerms[],3,0),\"\")","v":2},{"$f":"IFERROR(VLOOKUP(Suppliers[[#This Row],[支払条件コード]],PmtTerms[],4,0),\"\")","v":0}]
["0000000047962","KN-047962","佐久間製麺㈱","佐久間製麺",{"$f":"LENB(Suppliers[[#This Row],[省略名称（半角18,全角9文字以下）]])","v":10},"12VV",{"$f":"VLOOKUP(Suppliers[[#This Row],[支払条件コード]],PmtTerms[#All],2,0)","v":"月末〆６０日後払"},{"$f":"IFERROR(VLOOKUP(Suppliers[[#This Row],[支払条件コード]],PmtTerms[],3,0),\"\")","v":3},{"$f":"IFERROR(VLOOKUP(Suppliers[[#This Row],[支払条件コード]],PmtTerms[],4,0),\"\")","v":0}]
["0000000047979","KN-047979","㈱村上金蔵商店","村上金蔵商店",{"$f":"LENB(Suppliers[[#This Row],[省略名称（半角18,全角9文字以下）]])","v":12},"11VV",{"$f":"VLOOKUP(Suppliers[[#This Row],[支払条件コード]],PmtTerms[#All],2,0)","v":"月末〆３０日後払"},{"$f":"IFERROR(VLOOKUP(Suppliers[[#This Row],[支払条件コード]],PmtTerms[],3,0),\"\")","v":2},{"$f":"IFERROR(VLOOKUP(Suppliers[[#This Row],[支払条件コード]],PmtTerms[],4,0),\"\")","v":0}]
["0000000049010","KN-049010","㈲小林蒟蒻製造所","小林蒟蒻製造所",{"$f":"LENB(Suppliers[[#This Row],[省略名称（半角18,全角9文字以下）]])","v":14},"11VV",{"$f":"VLOOKUP(Suppliers[[#This Row],[支払条件コード]],PmtTerms[#All],2,0)","v":"月末〆３０日後払"},{"$f":"IFERROR(VLOOKUP(Suppliers[[#This Row],[支払条件コード]],PmtTerms[],3,0),\"\")","v":2},{"$f":"IFERROR(VLOOKUP(Suppliers[[#This Row],[支払条件コード]],PmtTerms[],4,0),\"\")","v":0}]
["0000000071040","KN-071040","㈲山岡商店","山岡商店",{"$f":"LENB(Suppliers[[#This Row],[省略名称（半角18,全角9文字以下）]])","v":8},"11VC",{"$f":"VLOOKUP(Suppliers[[#This Row],[支払条件コード]],PmtTerms[#All],2,0)","v":"月末〆１２日後払"},{"$f":"IFERROR(VLOOKUP(Suppliers[[#This Row],[支払条件コード]],PmtTerms[],3,0),\"\")","v":1},{"$f":"IFERROR(VLOOKUP(Suppliers[[#This Row],[支払条件コード]],PmtTerms[],4,0),\"\")","v":12}]
["0000000071200","KN-071200","丸湘水産㈱","丸湘水産",{"$f":"LENB(Suppliers[[#This Row],[省略名称（半角18,全角9文字以下）]])","v":8},"12VA",{"$f":"VLOOKUP(Suppliers[[#This Row],[支払条件コード]],PmtTerms[#All],2,0)","v":"月末〆４０日後払"},{"$f":"IFERROR(VLOOKUP(Suppliers[[#This Row],[支払条件コード]],PmtTerms[],3,0),\"\")","v":2},{"$f":"IFERROR(VLOOKUP(Suppliers[[#This Row],[支払条件コード]],PmtTerms[],4,0),\"\")","v":10}]
["0000000079037","KN-079037","㈱山不二","山不二",{"$f":"LENB(Suppliers[[#This Row],[省略名称（半角18,全角9文字以下）]])","v":6},"11VK",{"$f":"VLOOKUP(Suppliers[[#This Row],[支払条件コード]],PmtTerms[#All],2,0)","v":"月末〆２０日後払"},{"$f":"IFERROR(VLOOKUP(Suppliers[[#This Row],[支払条件コード]],PmtTerms[],3,0),\"\")","v":1},{"$f":"IFERROR(VLOOKUP(Suppliers[[#This Row],[支払条件コード]],PmtTerms[],4,0),\"\")","v":20}]
["0000000079151","KN-079151","川窪商店","川窪商店",{"$f":"LENB(Suppliers[[#This Row],[省略名称（半角18,全角9文字以下）]])","v":8},"0001",{"$f":"VLOOKUP(Suppliers[[#This Row],[支払条件コード]],PmtTerms[#All],2,0)","v":"計上後即時"},{"$f":"IFERROR(VLOOKUP(Suppliers[[#This Row],[支払条件コード]],PmtTerms[],3,0),\"\")","v":0},{"$f":"IFERROR(VLOOKUP(Suppliers[[#This Row],[支払条件コード]],PmtTerms[],4,0),\"\")","v":0}]
["0000000011270","KN-0Z0100","(株)日新","日新",{"$f":"LENB(Suppliers[[#This Row],[省略名称（半角18,全角9文字以下）]])","v":4},"11VV",{"$f":"VLOOKUP(Suppliers[[#This Row],[支払条件コード]],PmtTerms[#All],2,0)","v":"月末〆３０日後払"},{"$f":"IFERROR(VLOOKUP(Suppliers[[#This Row],[支払条件コード]],PmtTerms[],3,0),\"\")","v":2},{"$f":"IFERROR(VLOOKUP(Suppliers[[#This Row],[支払条件コード]],PmtTerms[],4,0),\"\")","v":0}]
["0000000111108","KN-111108","金田屋㈱","金田屋",{"$f":"LENB(Suppliers[[#This Row],[省略名称（半角18,全角9文字以下）]])","v":6},"11VV",{"$f":"VLOOKUP(Suppliers[[#This Row],[支払条件コード]],PmtTerms[#All],2,0)","v":"月末〆３０日後払"},{"$f":"IFERROR(VLOOKUP(Suppliers[[#This Row],[支払条件コード]],PmtTerms[],3,0),\"\")","v":2},{"$f":"IFERROR(VLOOKUP(Suppliers[[#This Row],[支払条件コード]],PmtTerms[],4,0),\"\")","v":0}]
["0000000111245","KN-111245","㈱永野鰹節店","永野鰹節店",{"$f":"LENB(Suppliers[[#This Row],[省略名称（半角18,全角9文字以下）]])","v":10},"11VP",{"$f":"VLOOKUP(Suppliers[[#This Row],[支払条件コード]],PmtTerms[#All],2,0)","v":"月末〆２５日後払"},{"$f":"IFERROR(VLOOKUP(Suppliers[[#This Row],[支払条件コード]],PmtTerms[],3,0),\"\")","v":1},{"$f":"IFERROR(VLOOKUP(Suppliers[[#This Row],[支払条件コード]],PmtTerms[],4,0),\"\")","v":25}]
["0000000111252","KN-111252","杉山商事㈱","杉山商事",{"$f":"LENB(Suppliers[[#This Row],[省略名称（半角18,全角9文字以下）]])","v":8},"11VV",{"$f":"VLOOKUP(Suppliers[[#This Row],[支払条件コード]],PmtTerms[#All],2,0)","v":"月末〆３０日後払"},{"$f":"IFERROR(VLOOKUP(Suppliers[[#This Row],[支払条件コード]],PmtTerms[],3,0),\"\")","v":2},{"$f":"IFERROR(VLOOKUP(Suppliers[[#This Row],[支払条件コード]],PmtTerms[],4,0),\"\")","v":0}]
["0000000111311","KN-111311","東海澱粉株式会社","東海澱粉株式会社",{"$f":"LENB(Suppliers[[#This Row],[省略名称（半角18,全角9文字以下）]])","v":16},"11VV",{"$f":"VLOOKUP(Suppliers[[#This Row],[支払条件コード]],PmtTerms[#All],2,0)","v":"月末〆３０日後払"},{"$f":"IFERROR(VLOOKUP(Suppliers[[#This Row],[支払条件コード]],PmtTerms[],3,0),\"\")","v":2},{"$f":"IFERROR(VLOOKUP(Suppliers[[#This Row],[支払条件コード]],PmtTerms[],4,0),\"\")","v":0}]
["0000000111511","KN-111511","㈱中戸川商店","中戸川商店",{"$f":"LENB(Suppliers[[#This Row],[省略名称（半角18,全角9文字以下）]])","v":10},"0001",{"$f":"VLOOKUP(Suppliers[[#This Row],[支払条件コード]],PmtTerms[#All],2,0)","v":"計上後即時"},{"$f":"IFERROR(VLOOKUP(Suppliers[[#This Row],[支払条件コード]],PmtTerms[],3,0),\"\")","v":0},{"$f":"IFERROR(VLOOKUP(Suppliers[[#This Row],[支払条件コード]],PmtTerms[],4,0),\"\")","v":0}]
["0000000111535","KN-111535","太陽商事㈱","太陽商事",{"$f":"LENB(Suppliers[[#This Row],[省略名称（半角18,全角9文字以下）]])","v":8},"12VV",{"$f":"VLOOKUP(Suppliers[[#This Row],[支払条件コード]],PmtTerms[#All],2,0)","v":"月末〆６０日後払"},{"$f":"IFERROR(VLOOKUP(Suppliers[[#This Row],[支払条件コード]],PmtTerms[],3,0),\"\")","v":3},{"$f":"IFERROR(VLOOKUP(Suppliers[[#This Row],[支払条件コード]],PmtTerms[],4,0),\"\")","v":0}]
["0000000111610","KN-111610","山本倉吉商店","山本倉吉商店",{"$f":"LENB(Suppliers[[#This Row],[省略名称（半角18,全角9文字以下）]])","v":12},"0001",{"$f":"VLOOKUP(Suppliers[[#This Row],[支払条件コード]],PmtTerms[#All],2,0)","v":"計上後即時"},{"$f":"IFERROR(VLOOKUP(Suppliers[[#This Row],[支払条件コード]],PmtTerms[],3,0),\"\")","v":0},{"$f":"IFERROR(VLOOKUP(Suppliers[[#This Row],[支払条件コード]],PmtTerms[],4,0),\"\")","v":0}]
["0000000111818","KN-111818","横浜南糧商事㈱","横浜南糧商事",{"$f":"LENB(Suppliers[[#This Row],[省略名称（半角18,全角9文字以下）]])","v":12},"11VF",{"$f":"VLOOKUP(Suppliers[[#This Row],[支払条件コード]],PmtTerms[#All],2,0)","v":"月末〆１５日後払"},{"$f":"IFERROR(VLOOKUP(Suppliers[[#This Row],[支払条件コード]],PmtTerms[],3,0),\"\")","v":1},{"$f":"IFERROR(VLOOKUP(Suppliers[[#This Row],[支払条件コード]],PmtTerms[],4,0),\"\")","v":15}]
["0000000111955","KN-111955","㈱上食","上食",{"$f":"LENB(Suppliers[[#This Row],[省略名称（半角18,全角9文字以下）]])","v":4},"0001",{"$f":"VLOOKUP(Suppliers[[#This Row],[支払条件コード]],PmtTerms[#All],2,0)","v":"計上後即時"},{"$f":"IFERROR(VLOOKUP(Suppliers[[#This Row],[支払条件コード]],PmtTerms[],3,0),\"\")","v":0},{"$f":"IFERROR(VLOOKUP(Suppliers[[#This Row],[支払条件コード]],PmtTerms[],4,0),\"\")","v":0}]
["0000000119301","KN-119301","㈱ﾎﾞｩ･ﾍﾞﾙ･ｻﾝﾃ","ﾎﾞｩ･ﾍﾞﾙ･ｻﾝﾃ",{"$f":"LENB(Suppliers[[#This Row],[省略名称（半角18,全角9文字以下）]])","v":11},"11KF",{"$f":"VLOOKUP(Suppliers[[#This Row],[支払条件コード]],PmtTerms[#All],2,0)","v":"２０日〆２５日後払"},{"$f":"IFERROR(VLOOKUP(Suppliers[[#This Row],[支払条件コード]],PmtTerms[],3,0),\"\")","v":1},{"$f":"IFERROR(VLOOKUP(Suppliers[[#This Row],[支払条件コード]],PmtTerms[],4,0),\"\")","v":15}]
["0000000119505","KN-119505","三栄フーズ株式会社","三栄フーズ",{"$f":"LENB(Suppliers[[#This Row],[省略名称（半角18,全角9文字以下）]])","v":10},"11VV",{"$f":"VLOOKUP(Suppliers[[#This Row],[支払条件コード]],PmtTerms[#All],2,0)","v":"月末〆３０日後払"},{"$f":"IFERROR(VLOOKUP(Suppliers[[#This Row],[支払条件コード]],PmtTerms[],3,0),\"\")","v":2},{"$f":"IFERROR(VLOOKUP(Suppliers[[#This Row],[支払条件コード]],PmtTerms[],4,0),\"\")","v":0}]
["0000000119706","KN-119706","ｴﾊﾞﾗ食品工業㈱製造部","ｴﾊﾞﾗ食品工業",{"$f":"LENB(Suppliers[[#This Row],[省略名称（半角18,全角9文字以下）]])","v":12},"11VK",{"$f":"VLOOKUP(Suppliers[[#This Row],[支払条件コード]],PmtTerms[#All],2,0)","v":"月末〆２０日後払"},{"$f":"IFERROR(VLOOKUP(Suppliers[[#This Row],[支払条件コード]],PmtTerms[],3,0),\"\")","v":1},{"$f":"IFERROR(VLOOKUP(Suppliers[[#This Row],[支払条件コード]],PmtTerms[],4,0),\"\")","v":20}]
["0000000119782","KN-119782","新雅","新雅",{"$f":"LENB(Suppliers[[#This Row],[省略名称（半角18,全角9文字以下）]])","v":4},"11VA",{"$f":"VLOOKUP(Suppliers[[#This Row],[支払条件コード]],PmtTerms[#All],2,0)","v":"月末〆１０日後払"},{"$f":"IFERROR(VLOOKUP(Suppliers[[#This Row],[支払条件コード]],PmtTerms[],3,0),\"\")","v":1},{"$f":"IFERROR(VLOOKUP(Suppliers[[#This Row],[支払条件コード]],PmtTerms[],4,0),\"\")","v":10}]
["0000000119812","KN-119812","㈱清水製餡所","清水製餡所",{"$f":"LENB(Suppliers[[#This Row],[省略名称（半角18,全角9文字以下）]])","v":10},"11VV",{"$f":"VLOOKUP(Suppliers[[#This Row],[支払条件コード]],PmtTerms[#All],2,0)","v":"月末〆３０日後払"},{"$f":"IFERROR(VLOOKUP(Suppliers[[#This Row],[支払条件コード]],PmtTerms[],3,0),\"\")","v":2},{"$f":"IFERROR(VLOOKUP(Suppliers[[#This Row],[支払条件コード]],PmtTerms[],4,0),\"\")","v":0}]
["0000000121020","KN-121020","㈱　昭　和","昭和",{"$f":"LENB(Suppliers[[#This Row],[省略名称（半角18,全角9文字以下）]])","v":4},"11VV",{"$f":"VLOOKUP(Suppliers[[#This Row],[支払条件コード]],PmtTerms[#All],2,0)","v":"月末〆３０日後払"},{"$f":"IFERROR(VLOOKUP(Suppliers[[#This Row],[支払条件コード]],PmtTerms[],3,0),\"\")","v":2},{"$f":"IFERROR(VLOOKUP(Suppliers[[#This Row],[支払条件コード]],PmtTerms[],4,0),\"\")","v":0}]
["0000000121198","KN-121198","㈱堀口商店","堀口商店",{"$f":"LENB(Suppliers[[#This Row],[省略名称（半角18,全角9文字以下）]])","v":8},"11VV",{"$f":"VLOOKUP(Suppliers[[#This Row],[支払条件コード]],PmtTerms[#All],2,0)","v":"月末〆３０日後払"},{"$f":"IFERROR(VLOOKUP(Suppliers[[#This Row],[支払条件コード]],PmtTerms[],3,0),\"\")","v":2},{"$f":"IFERROR(VLOOKUP(Suppliers[[#This Row],[支払条件コード]],PmtTerms[],4,0),\"\")","v":0}]
["0000000121204","KN-121204","㈱協同","協同",{"$f":"LENB(Suppliers[[#This Row],[省略名称（半角18,全角9文字以下）]])","v":4},"11VK",{"$f":"VLOOKUP(Suppliers[[#This Row],[支払条件コード]],PmtTerms[#All],2,0)","v":"月末〆２０日後払"},{"$f":"IFERROR(VLOOKUP(Suppliers[[#This Row],[支払条件コード]],PmtTerms[],3,0),\"\")","v":1},{"$f":"IFERROR(VLOOKUP(Suppliers[[#This Row],[支払条件コード]],PmtTerms[],4,0),\"\")","v":20}]
["0000000121235","KN-121235","横須賀青果商業","横須賀青果商業",{"$f":"LENB(Suppliers[[#This Row],[省略名称（半角18,全角9文字以下）]])","v":14},"11KA",{"$f":"VLOOKUP(Suppliers[[#This Row],[支払条件コード]],PmtTerms[#All],2,0)","v":"２０日〆２０日後払"},{"$f":"IFERROR(VLOOKUP(Suppliers[[#This Row],[支払条件コード]],PmtTerms[],3,0),\"\")","v":1},{"$f":"IFERROR(VLOOKUP(Suppliers[[#This Row],[支払条件コード]],PmtTerms[],4,0),\"\")","v":10}]
["0000000121259","KN-121259","㈱調味商事（食品口）","調味商事（食品口）",{"$f":"LENB(Suppliers[[#This Row],[省略名称（半角18,全角9文字以下）]])","v":18},"11VV",{"$f":"VLOOKUP(Suppliers[[#This Row],[支払条件コード]],PmtTerms[#All],2,0)","v":"月末〆３０日後払"},{"$f":"IFERROR(VLOOKUP(Suppliers[[#This Row],[支払条件コード]],PmtTerms[],3,0),\"\")","v":2},{"$f":"IFERROR(VLOOKUP(Suppliers[[#This Row],[支払条件コード]],PmtTerms[],4,0),\"\")","v":0}]
["0000000121365","KN-121365","アクトサプライ㈱","アクトサプライ",{"$f":"LENB(Suppliers[[#This Row],[省略名称（半角18,全角9文字以下）]])","v":14},"12VF",{"$f":"VLOOKUP(Suppliers[[#This Row],[支払条件コード]],PmtTerms[#All],2,0)","v":"月末〆４５日後払"},{"$f":"IFERROR(VLOOKUP(Suppliers[[#This Row],[支払条件コード]],PmtTerms[],3,0),\"\")","v":2},{"$f":"IFERROR(VLOOKUP(Suppliers[[#This Row],[支払条件コード]],PmtTerms[],4,0),\"\")","v":15}]
["0000000121402","KN-121402","㈱メイワ","メイワ",{"$f":"LENB(Suppliers[[#This Row],[省略名称（半角18,全角9文字以下）]])","v":6},"11VV",{"$f":"VLOOKUP(Suppliers[[#This Row],[支払条件コード]],PmtTerms[#All],2,0)","v":"月末〆３０日後払"},{"$f":"IFERROR(VLOOKUP(Suppliers[[#This Row],[支払条件コード]],PmtTerms[],3,0),\"\")","v":2},{"$f":"IFERROR(VLOOKUP(Suppliers[[#This Row],[支払条件コード]],PmtTerms[],4,0),\"\")","v":0}]
["0000000121556","KN-121556","㈱柏木","柏木",{"$f":"LENB(Suppliers[[#This Row],[省略名称（半角18,全角9文字以下）]])","v":4},"12VV",{"$f":"VLOOKUP(Suppliers[[#This Row],[支払条件コード]],PmtTerms[#All],2,0)","v":"月末〆６０日後払"},{"$f":"IFERROR(VLOOKUP(Suppliers[[#This Row],[支払条件コード]],PmtTerms[],3,0),\"\")","v":3},{"$f":"IFERROR(VLOOKUP(Suppliers[[#This Row],[支払条件コード]],PmtTerms[],4,0),\"\")","v":0}]
["0000000121778","KN-121778","㈱　鈴　隆","鈴隆",{"$f":"LENB(Suppliers[[#This Row],[省略名称（半角18,全角9文字以下）]])","v":4},"11VP",{"$f":"VLOOKUP(Suppliers[[#This Row],[支払条件コード]],PmtTerms[#All],2,0)","v":"月末〆２５日後払"},{"$f":"IFERROR(VLOOKUP(Suppliers[[#This Row],[支払条件コード]],PmtTerms[],3,0),\"\")","v":1},{"$f":"IFERROR(VLOOKUP(Suppliers[[#This Row],[支払条件コード]],PmtTerms[],4,0),\"\")","v":25}]
["0000000121792","KN-121792","東京カセ－　㈱","東京カセ－",{"$f":"LENB(Suppliers[[#This Row],[省略名称（半角18,全角9文字以下）]])","v":10},"12KK",{"$f":"VLOOKUP(Suppliers[[#This Row],[支払条件コード]],PmtTerms[#All],2,0)","v":"２０日〆６０日後払"},{"$f":"IFERROR(VLOOKUP(Suppliers[[#This Row],[支払条件コード]],PmtTerms[],3,0),\"\")","v":2},{"$f":"IFERROR(VLOOKUP(Suppliers[[#This Row],[支払条件コード]],PmtTerms[],4,0),\"\")","v":20}]
["0000000121822","KN-121822","㈲勉強堂","勉強堂",{"$f":"LENB(Suppliers[[#This Row],[省略名称（半角18,全角9文字以下）]])","v":6},"12VV",{"$f":"VLOOKUP(Suppliers[[#This Row],[支払条件コード]],PmtTerms[#All],2,0)","v":"月末〆６０日後払"},{"$f":"IFERROR(VLOOKUP(Suppliers[[#This Row],[支払条件コード]],PmtTerms[],3,0),\"\")","v":3},{"$f":"IFERROR(VLOOKUP(Suppliers[[#This Row],[支払条件コード]],PmtTerms[],4,0),\"\")","v":0}]
["0000000121907","KN-121907","㈱城水","城水",{"$f":"LENB(Suppliers[[#This Row],[省略名称（半角18,全角9文字以下）]])","v":4},"11VV",{"$f":"VLOOKUP(Suppliers[[#This Row],[支払条件コード]],PmtTerms[#All],2,0)","v":"月末〆３０日後払"},{"$f":"IFERROR(VLOOKUP(Suppliers[[#This Row],[支払条件コード]],PmtTerms[],3,0),\"\")","v":2},{"$f":"IFERROR(VLOOKUP(Suppliers[[#This Row],[支払条件コード]],PmtTerms[],4,0),\"\")","v":0}]
["0000000123750","KN-123750","㈲たからや","たからや",{"$f":"LENB(Suppliers[[#This Row],[省略名称（半角18,全角9文字以下）]])","v":8},"11VA",{"$f":"VLOOKUP(Suppliers[[#This Row],[支払条件コード]],PmtTerms[#All],2,0)","v":"月末〆１０日後払"},{"$f":"IFERROR(VLOOKUP(Suppliers[[#This Row],[支払条件コード]],PmtTerms[],3,0),\"\")","v":1},{"$f":"IFERROR(VLOOKUP(Suppliers[[#This Row],[支払条件コード]],PmtTerms[],4,0),\"\")","v":10}]
["0000000126773","KN-126773","㈲丸清製麺","丸清製麺",{"$f":"LENB(Suppliers[[#This Row],[省略名称（半角18,全角9文字以下）]])","v":8},"11VV",{"$f":"VLOOKUP(Suppliers[[#This Row],[支払条件コード]],PmtTerms[#All],2,0)","v":"月末〆３０日後払"},{"$f":"IFERROR(VLOOKUP(Suppliers[[#This Row],[支払条件コード]],PmtTerms[],3,0),\"\")","v":2},{"$f":"IFERROR(VLOOKUP(Suppliers[[#This Row],[支払条件コード]],PmtTerms[],4,0),\"\")","v":0}]
["0000000126803","KN-126803","扇や製麺店","扇や製麺店",{"$f":"LENB(Suppliers[[#This Row],[省略名称（半角18,全角9文字以下）]])","v":10},"11VV",{"$f":"VLOOKUP(Suppliers[[#This Row],[支払条件コード]],PmtTerms[#All],2,0)","v":"月末〆３０日後払"},{"$f":"IFERROR(VLOOKUP(Suppliers[[#This Row],[支払条件コード]],PmtTerms[],3,0),\"\")","v":2},{"$f":"IFERROR(VLOOKUP(Suppliers[[#This Row],[支払条件コード]],PmtTerms[],4,0),\"\")","v":0}]
["0000000126834","KN-126834","㈲増田製麺","増田製麺",{"$f":"LENB(Suppliers[[#This Row],[省略名称（半角18,全角9文字以下）]])","v":8},"11VK",{"$f":"VLOOKUP(Suppliers[[#This Row],[支払条件コード]],PmtTerms[#All],2,0)","v":"月末〆２０日後払"},{"$f":"IFERROR(VLOOKUP(Suppliers[[#This Row],[支払条件コード]],PmtTerms[],3,0),\"\")","v":1},{"$f":"IFERROR(VLOOKUP(Suppliers[[#This Row],[支払条件コード]],PmtTerms[],4,0),\"\")","v":20}]
["0000000129024","KN-129024","㈱ヤチヨ","ヤチヨ",{"$f":"LENB(Suppliers[[#This Row],[省略名称（半角18,全角9文字以下）]])","v":6},"12VF",{"$f":"VLOOKUP(Suppliers[[#This Row],[支払条件コード]],PmtTerms[#All],2,0)","v":"月末〆４５日後払"},{"$f":"IFERROR(VLOOKUP(Suppliers[[#This Row],[支払条件コード]],PmtTerms[],3,0),\"\")","v":2},{"$f":"IFERROR(VLOOKUP(Suppliers[[#This Row],[支払条件コード]],PmtTerms[],4,0),\"\")","v":15}]
["0000000129079","KN-129079","みさきまぐろ倶楽部","みさきまぐろ倶楽部",{"$f":"LENB(Suppliers[[#This Row],[省略名称（半角18,全角9文字以下）]])","v":18},"11VF",{"$f":"VLOOKUP(Suppliers[[#This Row],[支払条件コード]],PmtTerms[#All],2,0)","v":"月末〆１５日後払"},{"$f":"IFERROR(VLOOKUP(Suppliers[[#This Row],[支払条件コード]],PmtTerms[],3,0),\"\")","v":1},{"$f":"IFERROR(VLOOKUP(Suppliers[[#This Row],[支払条件コード]],PmtTerms[],4,0),\"\")","v":15}]
["0000000129106","KN-129106","㈱ｴﾅｼﾞｰ","ｴﾅｼﾞｰ",{"$f":"LENB(Suppliers[[#This Row],[省略名称（半角18,全角9文字以下）]])","v":5},"11VV",{"$f":"VLOOKUP(Suppliers[[#This Row],[支払条件コード]],PmtTerms[#All],2,0)","v":"月末〆３０日後払"},{"$f":"IFERROR(VLOOKUP(Suppliers[[#This Row],[支払条件コード]],PmtTerms[],3,0),\"\")","v":2},{"$f":"IFERROR(VLOOKUP(Suppliers[[#This Row],[支払条件コード]],PmtTerms[],4,0),\"\")","v":0}]
["0000000130031","KN-130031","㈱かね善","かね善",{"$f":"LENB(Suppliers[[#This Row],[省略名称（半角18,全角9文字以下）]])","v":6},"11VV",{"$f":"VLOOKUP(Suppliers[[#This Row],[支払条件コード]],PmtTerms[#All],2,0)","v":"月末〆３０日後払"},{"$f":"IFERROR(VLOOKUP(Suppliers[[#This Row],[支払条件コード]],PmtTerms[],3,0),\"\")","v":2},{"$f":"IFERROR(VLOOKUP(Suppliers[[#This Row],[支払条件コード]],PmtTerms[],4,0),\"\")","v":0}]
["0000000131027","KN-131027","上田商店","上田商店",{"$f":"LENB(Suppliers[[#This Row],[省略名称（半角18,全角9文字以下）]])","v":8},"0001",{"$f":"VLOOKUP(Suppliers[[#This Row],[支払条件コード]],PmtTerms[#All],2,0)","v":"計上後即時"},{"$f":"IFERROR(VLOOKUP(Suppliers[[#This Row],[支払条件コード]],PmtTerms[],3,0),\"\")","v":0},{"$f":"IFERROR(VLOOKUP(Suppliers[[#This Row],[支払条件コード]],PmtTerms[],4,0),\"\")","v":0}]
["0000000131031","KN-131031","株式会社玄田商店","玄田商店",{"$f":"LENB(Suppliers[[#This Row],[省略名称（半角18,全角9文字以下）]])","v":8},"11VV",{"$f":"VLOOKUP(Suppliers[[#This Row],[支払条件コード]],PmtTerms[#All],2,0)","v":"月末〆３０日後払"},{"$f":"IFERROR(VLOOKUP(Suppliers[[#This Row],[支払条件コード]],PmtTerms[],3,0),\"\")","v":2},{"$f":"IFERROR(VLOOKUP(Suppliers[[#This Row],[支払条件コード]],PmtTerms[],4,0),\"\")","v":0}]
["0000000131058","KN-131058","㈱今井商店","今井商店",{"$f":"LENB(Suppliers[[#This Row],[省略名称（半角18,全角9文字以下）]])","v":8},"11KC",{"$f":"VLOOKUP(Suppliers[[#This Row],[支払条件コード]],PmtTerms[#All],2,0)","v":"２０日〆２２日後払"},{"$f":"IFERROR(VLOOKUP(Suppliers[[#This Row],[支払条件コード]],PmtTerms[],3,0),\"\")","v":1},{"$f":"IFERROR(VLOOKUP(Suppliers[[#This Row],[支払条件コード]],PmtTerms[],4,0),\"\")","v":12}]
["0000000131089","KN-131089","㈱内田からし","内田からし",{"$f":"LENB(Suppliers[[#This Row],[省略名称（半角18,全角9文字以下）]])","v":10},"11KK",{"$f":"VLOOKUP(Suppliers[[#This Row],[支払条件コード]],PmtTerms[#All],2,0)","v":"２０日〆３０日後払"},{"$f":"IFERROR(VLOOKUP(Suppliers[[#This Row],[支払条件コード]],PmtTerms[],3,0),\"\")","v":1},{"$f":"IFERROR(VLOOKUP(Suppliers[[#This Row],[支払条件コード]],PmtTerms[],4,0),\"\")","v":20}]
["0000000131287","KN-131287","㈱協和物産","協和物産",{"$f":"LENB(Suppliers[[#This Row],[省略名称（半角18,全角9文字以下）]])","v":8},"11VK",{"$f":"VLOOKUP(Suppliers[[#This Row],[支払条件コード]],PmtTerms[#All],2,0)","v":"月末〆２０日後払"},{"$f":"IFERROR(VLOOKUP(Suppliers[[#This Row],[支払条件コード]],PmtTerms[],3,0),\"\")","v":1},{"$f":"IFERROR(VLOOKUP(Suppliers[[#This Row],[支払条件コード]],PmtTerms[],4,0),\"\")","v":20}]
["0000000131355","KN-131355","㈲木村茂商店","木村茂商店",{"$f":"LENB(Suppliers[[#This Row],[省略名称（半角18,全角9文字以下）]])","v":10},"12VV",{"$f":"VLOOKUP(Suppliers[[#This Row],[支払条件コード]],PmtTerms[#All],2,0)","v":"月末〆６０日後払"},{"$f":"IFERROR(VLOOKUP(Suppliers[[#This Row],[支払条件コード]],PmtTerms[],3,0),\"\")","v":3},{"$f":"IFERROR(VLOOKUP(Suppliers[[#This Row],[支払条件コード]],PmtTerms[],4,0),\"\")","v":0}]
["0000000131379","KN-131379","㈱沼田商事","沼田商事",{"$f":"LENB(Suppliers[[#This Row],[省略名称（半角18,全角9文字以下）]])","v":8},"12VV",{"$f":"VLOOKUP(Suppliers[[#This Row],[支払条件コード]],PmtTerms[#All],2,0)","v":"月末〆６０日後払"},{"$f":"IFERROR(VLOOKUP(Suppliers[[#This Row],[支払条件コード]],PmtTerms[],3,0),\"\")","v":3},{"$f":"IFERROR(VLOOKUP(Suppliers[[#This Row],[支払条件コード]],PmtTerms[],4,0),\"\")","v":0}]
["0000000131454","KN-131454","㈱高原商店","高原商店",{"$f":"LENB(Suppliers[[#This Row],[省略名称（半角18,全角9文字以下）]])","v":8},"11VK",{"$f":"VLOOKUP(Suppliers[[#This Row],[支払条件コード]],PmtTerms[#All],2,0)","v":"月末〆２０日後払"},{"$f":"IFERROR(VLOOKUP(Suppliers[[#This Row],[支払条件コード]],PmtTerms[],3,0),\"\")","v":1},{"$f":"IFERROR(VLOOKUP(Suppliers[[#This Row],[支払条件コード]],PmtTerms[],4,0),\"\")","v":20}]
["0000000131737","KN-131737","㈱耀盛號","耀盛號",{"$f":"LENB(Suppliers[[#This Row],[省略名称（半角18,全角9文字以下）]])","v":6},"12VV",{"$f":"VLOOKUP(Suppliers[[#This Row],[支払条件コード]],PmtTerms[#All],2,0)","v":"月末〆６０日後払"},{"$f":"IFERROR(VLOOKUP(Suppliers[[#This Row],[支払条件コード]],PmtTerms[],3,0),\"\")","v":3},{"$f":"IFERROR(VLOOKUP(Suppliers[[#This Row],[支払条件コード]],PmtTerms[],4,0),\"\")","v":0}]
["0000000131768","KN-131768","㈱薩田商店","薩田商店",{"$f":"LENB(Suppliers[[#This Row],[省略名称（半角18,全角9文字以下）]])","v":8},"11VV",{"$f":"VLOOKUP(Suppliers[[#This Row],[支払条件コード]],PmtTerms[#All],2,0)","v":"月末〆３０日後払"},{"$f":"IFERROR(VLOOKUP(Suppliers[[#This Row],[支払条件コード]],PmtTerms[],3,0),\"\")","v":2},{"$f":"IFERROR(VLOOKUP(Suppliers[[#This Row],[支払条件コード]],PmtTerms[],4,0),\"\")","v":0}]
["0000000131898","KN-131898","(資）中丸屋商店","中丸屋商店",{"$f":"LENB(Suppliers[[#This Row],[省略名称（半角18,全角9文字以下）]])","v":10},"0001",{"$f":"VLOOKUP(Suppliers[[#This Row],[支払条件コード]],PmtTerms[#All],2,0)","v":"計上後即時"},{"$f":"IFERROR(VLOOKUP(Suppliers[[#This Row],[支払条件コード]],PmtTerms[],3,0),\"\")","v":0},{"$f":"IFERROR(VLOOKUP(Suppliers[[#This Row],[支払条件コード]],PmtTerms[],4,0),\"\")","v":0}]
["0000000136206","KN-136206","㈲湯本製麺所","湯本製麺所",{"$f":"LENB(Suppliers[[#This Row],[省略名称（半角18,全角9文字以下）]])","v":10},"12VV",{"$f":"VLOOKUP(Suppliers[[#This Row],[支払条件コード]],PmtTerms[#All],2,0)","v":"月末〆６０日後払"},{"$f":"IFERROR(VLOOKUP(Suppliers[[#This Row],[支払条件コード]],PmtTerms[],3,0),\"\")","v":3},{"$f":"IFERROR(VLOOKUP(Suppliers[[#This Row],[支払条件コード]],PmtTerms[],4,0),\"\")","v":0}]
["0000000136718","KN-136718","㈲正華","正華",{"$f":"LENB(Suppliers[[#This Row],[省略名称（半角18,全角9文字以下）]])","v":4},"11VK",{"$f":"VLOOKUP(Suppliers[[#This Row],[支払条件コード]],PmtTerms[#All],2,0)","v":"月末〆２０日後払"},{"$f":"IFERROR(VLOOKUP(Suppliers[[#This Row],[支払条件コード]],PmtTerms[],3,0),\"\")","v":1},{"$f":"IFERROR(VLOOKUP(Suppliers[[#This Row],[支払条件コード]],PmtTerms[],4,0),\"\")","v":20}]
["0000000139717","KN-139717","㈲同發","同發",{"$f":"LENB(Suppliers[[#This Row],[省略名称（半角18,全角9文字以下）]])","v":4},"11VC",{"$f":"VLOOKUP(Suppliers[[#This Row],[支払条件コード]],PmtTerms[#All],2,0)","v":"月末〆１２日後払"},{"$f":"IFERROR(VLOOKUP(Suppliers[[#This Row],[支払条件コード]],PmtTerms[],3,0),\"\")","v":1},{"$f":"IFERROR(VLOOKUP(Suppliers[[#This Row],[支払条件コード]],PmtTerms[],4,0),\"\")","v":12}]
["0000000141123","KN-141123","㈱中村商店","中村商店",{"$f":"LENB(Suppliers[[#This Row],[省略名称（半角18,全角9文字以下）]])","v":8},"12VV",{"$f":"VLOOKUP(Suppliers[[#This Row],[支払条件コード]],PmtTerms[#All],2,0)","v":"月末〆６０日後払"},{"$f":"IFERROR(VLOOKUP(Suppliers[[#This Row],[支払条件コード]],PmtTerms[],3,0),\"\")","v":3},{"$f":"IFERROR(VLOOKUP(Suppliers[[#This Row],[支払条件コード]],PmtTerms[],4,0),\"\")","v":0}]
["0000000141130","KN-141130","(有)みなと鰹節","みなと鰹節",{"$f":"LENB(Suppliers[[#This Row],[省略名称（半角18,全角9文字以下）]])","v":10},"0001",{"$f":"VLOOKUP(Suppliers[[#This Row],[支払条件コード]],PmtTerms[#All],2,0)","v":"計上後即時"},{"$f":"IFERROR(VLOOKUP(Suppliers[[#This Row],[支払条件コード]],PmtTerms[],3,0),\"\")","v":0},{"$f":"IFERROR(VLOOKUP(Suppliers[[#This Row],[支払条件コード]],PmtTerms[],4,0),\"\")","v":0}]
["0000000141154","KN-141154","寿屋商事㈱","寿屋商事",{"$f":"LENB(Suppliers[[#This Row],[省略名称（半角18,全角9文字以下）]])","v":8},"11VV",{"$f":"VLOOKUP(Suppliers[[#This Row],[支払条件コード]],PmtTerms[#All],2,0)","v":"月末〆３０日後払"},{"$f":"IFERROR(VLOOKUP(Suppliers[[#This Row],[支払条件コード]],PmtTerms[],3,0),\"\")","v":2},{"$f":"IFERROR(VLOOKUP(Suppliers[[#This Row],[支払条件コード]],PmtTerms[],4,0),\"\")","v":0}]
["0000000141185","KN-141185","㈲今村商店","今村商店",{"$f":"LENB(Suppliers[[#This Row],[省略名称（半角18,全角9文字以下）]])","v":8},"11VV",{"$f":"VLOOKUP(Suppliers[[#This Row],[支払条件コード]],PmtTerms[#All],2,0)","v":"月末〆３０日後払"},{"$f":"IFERROR(VLOOKUP(Suppliers[[#This Row],[支払条件コード]],PmtTerms[],3,0),\"\")","v":2},{"$f":"IFERROR(VLOOKUP(Suppliers[[#This Row],[支払条件コード]],PmtTerms[],4,0),\"\")","v":0}]
["0000000141383","KN-141383","㈲山　富","山富",{"$f":"LENB(Suppliers[[#This Row],[省略名称（半角18,全角9文字以下）]])","v":4},"12VF",{"$f":"VLOOKUP(Suppliers[[#This Row],[支払条件コード]],PmtTerms[#All],2,0)","v":"月末〆４５日後払"},{"$f":"IFERROR(VLOOKUP(Suppliers[[#This Row],[支払条件コード]],PmtTerms[],3,0),\"\")","v":2},{"$f":"IFERROR(VLOOKUP(Suppliers[[#This Row],[支払条件コード]],PmtTerms[],4,0),\"\")","v":15}]
["0000000141390","KN-141390","㈲池谷商店","池谷商店",{"$f":"LENB(Suppliers[[#This Row],[省略名称（半角18,全角9文字以下）]])","v":8},"12VP",{"$f":"VLOOKUP(Suppliers[[#This Row],[支払条件コード]],PmtTerms[#All],2,0)","v":"月末〆５５日後払"},{"$f":"IFERROR(VLOOKUP(Suppliers[[#This Row],[支払条件コード]],PmtTerms[],3,0),\"\")","v":2},{"$f":"IFERROR(VLOOKUP(Suppliers[[#This Row],[支払条件コード]],PmtTerms[],4,0),\"\")","v":25}]
["0000000141574","KN-141574","㈲クッキングヘルプ","クッキングヘルプ",{"$f":"LENB(Suppliers[[#This Row],[省略名称（半角18,全角9文字以下）]])","v":16},"0001",{"$f":"VLOOKUP(Suppliers[[#This Row],[支払条件コード]],PmtTerms[#All],2,0)","v":"計上後即時"},{"$f":"IFERROR(VLOOKUP(Suppliers[[#This Row],[支払条件コード]],PmtTerms[],3,0),\"\")","v":0},{"$f":"IFERROR(VLOOKUP(Suppliers[[#This Row],[支払条件コード]],PmtTerms[],4,0),\"\")","v":0}]
["0000000141925","KN-141925","東洋香辛　㈱","東洋香辛",{"$f":"LENB(Suppliers[[#This Row],[省略名称（半角18,全角9文字以下）]])","v":8},"11VP",{"$f":"VLOOKUP(Suppliers[[#This Row],[支払条件コード]],PmtTerms[#All],2,0)","v":"月末〆２５日後払"},{"$f":"IFERROR(VLOOKUP(Suppliers[[#This Row],[支払条件コード]],PmtTerms[],3,0),\"\")","v":1},{"$f":"IFERROR(VLOOKUP(Suppliers[[#This Row],[支払条件コード]],PmtTerms[],4,0),\"\")","v":25}]
["0000000141932","KN-141932","木下製あん所","木下製あん所",{"$f":"LENB(Suppliers[[#This Row],[省略名称（半角18,全角9文字以下）]])","v":12},"0001",{"$f":"VLOOKUP(Suppliers[[#This Row],[支払条件コード]],PmtTerms[#All],2,0)","v":"計上後即時"},{"$f":"IFERROR(VLOOKUP(Suppliers[[#This Row],[支払条件コード]],PmtTerms[],3,0),\"\")","v":0},{"$f":"IFERROR(VLOOKUP(Suppliers[[#This Row],[支払条件コード]],PmtTerms[],4,0),\"\")","v":0}]
["0000000143101","KN-143101","高久製パン （株）","高久製パン",{"$f":"LENB(Suppliers[[#This Row],[省略名称（半角18,全角9文字以下）]])","v":10},"11VV",{"$f":"VLOOKUP(Suppliers[[#This Row],[支払条件コード]],PmtTerms[#All],2,0)","v":"月末〆３０日後払"},{"$f":"IFERROR(VLOOKUP(Suppliers[[#This Row],[支払条件コード]],PmtTerms[],3,0),\"\")","v":2},{"$f":"IFERROR(VLOOKUP(Suppliers[[#This Row],[支払条件コード]],PmtTerms[],4,0),\"\")","v":0}]
["0000000143747","KN-143747","金澤製パン㈲","金澤製パン",{"$f":"LENB(Suppliers[[#This Row],[省略名称（半角18,全角9文字以下）]])","v":10},"11VV",{"$f":"VLOOKUP(Suppliers[[#This Row],[支払条件コード]],PmtTerms[#All],2,0)","v":"月末〆３０日後払"},{"$f":"IFERROR(VLOOKUP(Suppliers[[#This Row],[支払条件コード]],PmtTerms[],3,0),\"\")","v":2},{"$f":"IFERROR(VLOOKUP(Suppliers[[#This Row],[支払条件コード]],PmtTerms[],4,0),\"\")","v":0}]
["0000000143785","KN-143785","㈲北原製パン所","北原製パン所",{"$f":"LENB(Suppliers[[#This Row],[省略名称（半角18,全角9文字以下）]])","v":12},"12VF",{"$f":"VLOOKUP(Suppliers[[#This Row],[支払条件コード]],PmtTerms[#All],2,0)","v":"月末〆４５日後払"},{"$f":"IFERROR(VLOOKUP(Suppliers[[#This Row],[支払条件コード]],PmtTerms[],3,0),\"\")","v":2},{"$f":"IFERROR(VLOOKUP(Suppliers[[#This Row],[支払条件コード]],PmtTerms[],4,0),\"\")","v":15}]
["0000000146074","KN-146074","㈲喜久屋","喜久屋",{"$f":"LENB(Suppliers[[#This Row],[省略名称（半角18,全角9文字以下）]])","v":6},"12VK",{"$f":"VLOOKUP(Suppliers[[#This Row],[支払条件コード]],PmtTerms[#All],2,0)","v":"月末〆５０日後払"},{"$f":"IFERROR(VLOOKUP(Suppliers[[#This Row],[支払条件コード]],PmtTerms[],3,0),\"\")","v":2},{"$f":"IFERROR(VLOOKUP(Suppliers[[#This Row],[支払条件コード]],PmtTerms[],4,0),\"\")","v":20}]
["0000000149011","KN-149011","㈲三河屋(茅ヶ崎）","三河屋(茅ヶ崎）",{"$f":"LENB(Suppliers[[#This Row],[省略名称（半角18,全角9文字以下）]])","v":15},"11KV",{"$f":"VLOOKUP(Suppliers[[#This Row],[支払条件コード]],PmtTerms[#All],2,0)","v":"２０日〆４０日後払"},{"$f":"IFERROR(VLOOKUP(Suppliers[[#This Row],[支払条件コード]],PmtTerms[],3,0),\"\")","v":2},{"$f":"IFERROR(VLOOKUP(Suppliers[[#This Row],[支払条件コード]],PmtTerms[],4,0),\"\")","v":0}]
["0000000149021","KN-149021","㈱美濃屋あられ","美濃屋あられ",{"$f":"LENB(Suppliers[[#This Row],[省略名称（半角18,全角9文字以下）]])","v":12},"11VP",{"$f":"VLOOKUP(Suppliers[[#This Row],[支払条件コード]],PmtTerms[#All],2,0)","v":"月末〆２５日後払"},{"$f":"IFERROR(VLOOKUP(Suppliers[[#This Row],[支払条件コード]],PmtTerms[],3,0),\"\")","v":1},{"$f":"IFERROR(VLOOKUP(Suppliers[[#This Row],[支払条件コード]],PmtTerms[],4,0),\"\")","v":25}]
["0000000149035","KN-149035","（資）三河屋(厚木）","三河屋(厚木）",{"$f":"LENB(Suppliers[[#This Row],[省略名称（半角18,全角9文字以下）]])","v":13},"0001",{"$f":"VLOOKUP(Suppliers[[#This Row],[支払条件コード]],PmtTerms[#All],2,0)","v":"計上後即時"},{"$f":"IFERROR(VLOOKUP(Suppliers[[#This Row],[支払条件コード]],PmtTerms[],3,0),\"\")","v":0},{"$f":"IFERROR(VLOOKUP(Suppliers[[#This Row],[支払条件コード]],PmtTerms[],4,0),\"\")","v":0}]
["0000000149051","KN-149051","㈱花見煎餅吾妻屋","花見煎餅吾妻屋",{"$f":"LENB(Suppliers[[#This Row],[省略名称（半角18,全角9文字以下）]])","v":14},"11VV",{"$f":"VLOOKUP(Suppliers[[#This Row],[支払条件コード]],PmtTerms[#All],2,0)","v":"月末〆３０日後払"},{"$f":"IFERROR(VLOOKUP(Suppliers[[#This Row],[支払条件コード]],PmtTerms[],3,0),\"\")","v":2},{"$f":"IFERROR(VLOOKUP(Suppliers[[#This Row],[支払条件コード]],PmtTerms[],4,0),\"\")","v":0}]
["0000000149103","KN-149103","㈱敷嶋あられ嵯峨の家","敷嶋あられ嵯峨の家",{"$f":"LENB(Suppliers[[#This Row],[省略名称（半角18,全角9文字以下）]])","v":18},"11VV",{"$f":"VLOOKUP(Suppliers[[#This Row],[支払条件コード]],PmtTerms[#All],2,0)","v":"月末〆３０日後払"},{"$f":"IFERROR(VLOOKUP(Suppliers[[#This Row],[支払条件コード]],PmtTerms[],3,0),\"\")","v":2},{"$f":"IFERROR(VLOOKUP(Suppliers[[#This Row],[支払条件コード]],PmtTerms[],4,0),\"\")","v":0}]
["0000000149165","KN-149165","そば処結城","そば処結城",{"$f":"LENB(Suppliers[[#This Row],[省略名称（半角18,全角9文字以下）]])","v":10},"11VV",{"$f":"VLOOKUP(Suppliers[[#This Row],[支払条件コード]],PmtTerms[#All],2,0)","v":"月末〆３０日後払"},{"$f":"IFERROR(VLOOKUP(Suppliers[[#This Row],[支払条件コード]],PmtTerms[],3,0),\"\")","v":2},{"$f":"IFERROR(VLOOKUP(Suppliers[[#This Row],[支払条件コード]],PmtTerms[],4,0),\"\")","v":0}]
["0000000149233","KN-149233","㈲　嘉山精肉店","嘉山精肉店",{"$f":"LENB(Suppliers[[#This Row],[省略名称（半角18,全角9文字以下）]])","v":10},"11VF",{"$f":"VLOOKUP(Suppliers[[#This Row],[支払条件コード]],PmtTerms[#All],2,0)","v":"月末〆１５日後払"},{"$f":"IFERROR(VLOOKUP(Suppliers[[#This Row],[支払条件コード]],PmtTerms[],3,0),\"\")","v":1},{"$f":"IFERROR(VLOOKUP(Suppliers[[#This Row],[支払条件コード]],PmtTerms[],4,0),\"\")","v":15}]
["0000000149714","KN-149714","㈱なかや商事相州そば","なかや商事相州そば",{"$f":"LENB(Suppliers[[#This Row],[省略名称（半角18,全角9文字以下）]])","v":18},"11VK",{"$f":"VLOOKUP(Suppliers[[#This Row],[支払条件コード]],PmtTerms[#All],2,0)","v":"月末〆２０日後払"},{"$f":"IFERROR(VLOOKUP(Suppliers[[#This Row],[支払条件コード]],PmtTerms[],3,0),\"\")","v":1},{"$f":"IFERROR(VLOOKUP(Suppliers[[#This Row],[支払条件コード]],PmtTerms[],4,0),\"\")","v":20}]
["0000000149752","KN-149752","㈲梅や","梅や",{"$f":"LENB(Suppliers[[#This Row],[省略名称（半角18,全角9文字以下）]])","v":4},"11VV",{"$f":"VLOOKUP(Suppliers[[#This Row],[支払条件コード]],PmtTerms[#All],2,0)","v":"月末〆３０日後払"},{"$f":"IFERROR(VLOOKUP(Suppliers[[#This Row],[支払条件コード]],PmtTerms[],3,0),\"\")","v":2},{"$f":"IFERROR(VLOOKUP(Suppliers[[#This Row],[支払条件コード]],PmtTerms[],4,0),\"\")","v":0}]
["0000000151007","KN-151007","㈱土方商店","土方商店",{"$f":"LENB(Suppliers[[#This Row],[省略名称（半角18,全角9文字以下）]])","v":8},"11VV",{"$f":"VLOOKUP(Suppliers[[#This Row],[支払条件コード]],PmtTerms[#All],2,0)","v":"月末〆３０日後払"},{"$f":"IFERROR(VLOOKUP(Suppliers[[#This Row],[支払条件コード]],PmtTerms[],3,0),\"\")","v":2},{"$f":"IFERROR(VLOOKUP(Suppliers[[#This Row],[支払条件コード]],PmtTerms[],4,0),\"\")","v":0}]
["0000000159051","KN-159051","みよしや","みよしや",{"$f":"LENB(Suppliers[[#This Row],[省略名称（半角18,全角9文字以下）]])","v":8},"11VA",{"$f":"VLOOKUP(Suppliers[[#This Row],[支払条件コード]],PmtTerms[#All],2,0)","v":"月末〆１０日後払"},{"$f":"IFERROR(VLOOKUP(Suppliers[[#This Row],[支払条件コード]],PmtTerms[],3,0),\"\")","v":1},{"$f":"IFERROR(VLOOKUP(Suppliers[[#This Row],[支払条件コード]],PmtTerms[],4,0),\"\")","v":10}]
["0000000159071","KN-159071","ﾃﾞﾘｶ源内（佐藤秀夫）","ﾃﾞﾘｶ源内(佐藤秀夫)",{"$f":"LENB(Suppliers[[#This Row],[省略名称（半角18,全角9文字以下）]])","v":18},"11VV",{"$f":"VLOOKUP(Suppliers[[#This Row],[支払条件コード]],PmtTerms[#All],2,0)","v":"月末〆３０日後払"},{"$f":"IFERROR(VLOOKUP(Suppliers[[#This Row],[支払条件コード]],PmtTerms[],3,0),\"\")","v":2},{"$f":"IFERROR(VLOOKUP(Suppliers[[#This Row],[支払条件コード]],PmtTerms[],4,0),\"\")","v":0}]
["0000001026715","KN-1026715","丸山製麺㈱","丸山製麺",{"$f":"LENB(Suppliers[[#This Row],[省略名称（半角18,全角9文字以下）]])","v":8},"12VF",{"$f":"VLOOKUP(Suppliers[[#This Row],[支払条件コード]],PmtTerms[#All],2,0)","v":"月末〆４５日後払"},{"$f":"IFERROR(VLOOKUP(Suppliers[[#This Row],[支払条件コード]],PmtTerms[],3,0),\"\")","v":2},{"$f":"IFERROR(VLOOKUP(Suppliers[[#This Row],[支払条件コード]],PmtTerms[],4,0),\"\")","v":15}]
["0000001036187","KN-1036187","㈱丸紀","丸紀",{"$f":"LENB(Suppliers[[#This Row],[省略名称（半角18,全角9文字以下）]])","v":4},"？",{"$f":"VLOOKUP(Suppliers[[#This Row],[支払条件コード]],PmtTerms[#All],2,0)","v":{"$error":"#N/A"}},{"$f":"IFERROR(VLOOKUP(Suppliers[[#This Row],[支払条件コード]],PmtTerms[],3,0),\"\")","v":""},{"$f":"IFERROR(VLOOKUP(Suppliers[[#This Row],[支払条件コード]],PmtTerms[],4,0),\"\")","v":""}]
["0000001041851","KN-1041851","ライオン商事㈱","ライオン商事",{"$f":"LENB(Suppliers[[#This Row],[省略名称（半角18,全角9文字以下）]])","v":12},"？",{"$f":"VLOOKUP(Suppliers[[#This Row],[支払条件コード]],PmtTerms[#All],2,0)","v":{"$error":"#N/A"}},{"$f":"IFERROR(VLOOKUP(Suppliers[[#This Row],[支払条件コード]],PmtTerms[],3,0),\"\")","v":""},{"$f":"IFERROR(VLOOKUP(Suppliers[[#This Row],[支払条件コード]],PmtTerms[],4,0),\"\")","v":""}]
["0000001046161","KN-1046161","横田製麺　海の家","横田製麺　海の家",{"$f":"LENB(Suppliers[[#This Row],[省略名称（半角18,全角9文字以下）]])","v":16},"11VV",{"$f":"VLOOKUP(Suppliers[[#This Row],[支払条件コード]],PmtTerms[#All],2,0)","v":"月末〆３０日後払"},{"$f":"IFERROR(VLOOKUP(Suppliers[[#This Row],[支払条件コード]],PmtTerms[],3,0),\"\")","v":2},{"$f":"IFERROR(VLOOKUP(Suppliers[[#This Row],[支払条件コード]],PmtTerms[],4,0),\"\")","v":0}]
["0000001121238","KN-1121238","横須賀青果商業協同組合","横須賀青果商業組合",{"$f":"LENB(Suppliers[[#This Row],[省略名称（半角18,全角9文字以下）]])","v":18},"？",{"$f":"VLOOKUP(Suppliers[[#This Row],[支払条件コード]],PmtTerms[#All],2,0)","v":{"$error":"#N/A"}},{"$f":"IFERROR(VLOOKUP(Suppliers[[#This Row],[支払条件コード]],PmtTerms[],3,0),\"\")","v":""},{"$f":"IFERROR(VLOOKUP(Suppliers[[#This Row],[支払条件コード]],PmtTerms[],4,0),\"\")","v":""}]
["0000001121900","KN-1121900","㈱城ケ島水産","城ケ島水産",{"$f":"LENB(Suppliers[[#This Row],[省略名称（半角18,全角9文字以下）]])","v":10},"11VV",{"$f":"VLOOKUP(Suppliers[[#This Row],[支払条件コード]],PmtTerms[#All],2,0)","v":"月末〆３０日後払"},{"$f":"IFERROR(VLOOKUP(Suppliers[[#This Row],[支払条件コード]],PmtTerms[],3,0),\"\")","v":2},{"$f":"IFERROR(VLOOKUP(Suppliers[[#This Row],[支払条件コード]],PmtTerms[],4,0),\"\")","v":0}]
["0000001131280","KN-1131280","㈱協和物産　東京","協和物産　東京",{"$f":"LENB(Suppliers[[#This Row],[省略名称（半角18,全角9文字以下）]])","v":14},"11VK",{"$f":"VLOOKUP(Suppliers[[#This Row],[支払条件コード]],PmtTerms[#All],2,0)","v":"月末〆２０日後払"},{"$f":"IFERROR(VLOOKUP(Suppliers[[#This Row],[支払条件コード]],PmtTerms[],3,0),\"\")","v":1},{"$f":"IFERROR(VLOOKUP(Suppliers[[#This Row],[支払条件コード]],PmtTerms[],4,0),\"\")","v":20}]
["0000001136711","KN-1136711","㈲　正華　２Ｆ","正華　２Ｆ",{"$f":"LENB(Suppliers[[#This Row],[省略名称（半角18,全角9文字以下）]])","v":10},"11VK",{"$f":"VLOOKUP(Suppliers[[#This Row],[支払条件コード]],PmtTerms[#All],2,0)","v":"月末〆２０日後払"},{"$f":"IFERROR(VLOOKUP(Suppliers[[#This Row],[支払条件コード]],PmtTerms[],3,0),\"\")","v":1},{"$f":"IFERROR(VLOOKUP(Suppliers[[#This Row],[支払条件コード]],PmtTerms[],4,0),\"\")","v":20}]
["0000002019055","KN-2019055","芳味園㈱","芳味園",{"$f":"LENB(Suppliers[[#This Row],[省略名称（半角18,全角9文字以下）]])","v":6},"12VV",{"$f":"VLOOKUP(Suppliers[[#This Row],[支払条件コード]],PmtTerms[#All],2,0)","v":"月末〆６０日後払"},{"$f":"IFERROR(VLOOKUP(Suppliers[[#This Row],[支払条件コード]],PmtTerms[],3,0),\"\")","v":3},{"$f":"IFERROR(VLOOKUP(Suppliers[[#This Row],[支払条件コード]],PmtTerms[],4,0),\"\")","v":0}]
["0000002046118","KN-2046118","㈱麻生","麻生",{"$f":"LENB(Suppliers[[#This Row],[省略名称（半角18,全角9文字以下）]])","v":4},"13KF",{"$f":"VLOOKUP(Suppliers[[#This Row],[支払条件コード]],PmtTerms[#All],2,0)","v":"２０日〆８５日後払"},{"$f":"IFERROR(VLOOKUP(Suppliers[[#This Row],[支払条件コード]],PmtTerms[],3,0),\"\")","v":3},{"$f":"IFERROR(VLOOKUP(Suppliers[[#This Row],[支払条件コード]],PmtTerms[],4,0),\"\")","v":15}]
["0000003019454","KN-3019454","㈱スワロー食品","スワロー食品",{"$f":"LENB(Suppliers[[#This Row],[省略名称（半角18,全角9文字以下）]])","v":12},"12VK",{"$f":"VLOOKUP(Suppliers[[#This Row],[支払条件コード]],PmtTerms[#All],2,0)","v":"月末〆５０日後払"},{"$f":"IFERROR(VLOOKUP(Suppliers[[#This Row],[支払条件コード]],PmtTerms[],3,0),\"\")","v":2},{"$f":"IFERROR(VLOOKUP(Suppliers[[#This Row],[支払条件コード]],PmtTerms[],4,0),\"\")","v":20}]
["0000002136714","KN-2136714","㈲　正華　3Ｆ","正華　3Ｆ",{"$f":"LENB(Suppliers[[#This Row],[省略名称（半角18,全角9文字以下）]])","v":9},"11VK",{"$f":"VLOOKUP(Suppliers[[#This Row],[支払条件コード]],PmtTerms[#All],2,0)","v":"月末〆２０日後払"},{"$f":"IFERROR(VLOOKUP(Suppliers[[#This Row],[支払条件コード]],PmtTerms[],3,0),\"\")","v":1},{"$f":"IFERROR(VLOOKUP(Suppliers[[#This Row],[支払条件コード]],PmtTerms[],4,0),\"\")","v":20}]
["0000000002756","KN-002756","二葉化成株式会社","二葉化成株式会社",{"$f":"LENB(Suppliers[[#This Row],[省略名称（半角18,全角9文字以下）]])","v":16},"11VV",{"$f":"VLOOKUP(Suppliers[[#This Row],[支払条件コード]],PmtTerms[#All],2,0)","v":"月末〆３０日後払"},{"$f":"IFERROR(VLOOKUP(Suppliers[[#This Row],[支払条件コード]],PmtTerms[],3,0),\"\")","v":2},{"$f":"IFERROR(VLOOKUP(Suppliers[[#This Row],[支払条件コード]],PmtTerms[],4,0),\"\")","v":0}]

{"sheet":"支払条件コード","index":4,"n_rows":163,"n_cols":6,"rows_kept":163,"cut":false,"hidden":false,"merged":[]}
["PayT","支払条件","Month ","Day"]
["0001","計上後即時",0,0,null,"入力規則"]
["000K","翌月分２０日払（前払）","","",null,"１．日数換算で30日を「1Month」とし、30日以下は「Day」としています。"]
["000P","翌月分２５日払（前払）","","",null,"２．月末〆15日後払いの場合、「30+15=45」となり、Month：「1」,Day：「15」と入力します。"]
["000V","翌月分月末払（前払）","",""]
[1058,"５日〆３日後（８日）払",0,8]
["105A","５日〆５日後払",0,10]
["105V","５日締め２５日後払",1,0]
["109A","９日〆１０日払",0,19]
["10AF","１０日〆５日後払",0,15]
["10AG","１０日〆６日後払",0,16]
["10AK","１０日〆１０日後払",0,20]
["10AP","１０日〆１５日後（２５日）払",0,25]
["10AV","１０日〆２０日後払",1,0]
["10FI","１５日〆３日後（１８日）払",0,18]
["10FK","１５日〆５日後（２０日）払",0,20]
["10FP","１５日〆１０日後払",0,25]
["10FV","１５日〆１５日後払",1,0]
["10JK","１９日〆２０日払",1,9]
["10KM","２０日〆２日後（２２日）払",0,22]
["10KP","２０日〆５日後（２５日）払",0,25]
["10KQ","２０日〆６日後（２６日）払",0,26]
["10KV","２０日〆１０後払",1,0]
["10PR","２５日〆２日後（２７日）払",0,27]
["10PV","２５日〆５日後払",1,0]
["114V","４日〆５６日後払",2,0]
[1155,"５日〆３０日後払",1,5]
["115V","５日〆５５日後払",2,0]
["11AA","１０日〆３０日後払",1,10]
["11AK","１０日〆４０日後払",1,20]
["11AV","１０日〆５０日後払",2,0]
["11DD","１３日〆３０日後払",1,13]
["11F5","１５日〆２０日後払",1,5]
["11FA","１５日〆２５日後払",1,10]
["11FF","１５日〆３０日後払",1,15]
["11FK","１５日〆３５日後払",1,20]
["11FP","１５日〆４０日後払",1,25]
["11FV","１５日〆４５日後払",2,0]
["11JK","１９日〆３１日後払",1,20]
["11K2","２０日〆１２日後払",1,2]
["11K5","２０日〆１５日後払",1,5]
["11KA","２０日〆２０日後払",1,10]
["11KB","２０日〆２１日後（１１日）払",1,11]
["11KC","２０日〆２２日後払",1,12]
["11KF","２０日〆２５日後払",1,15]
["11KH","２０日〆２７日後払",1,17]
["11KI","２０日〆２８日後払",1,18]
["11KK","２０日〆３０日後払",1,20]
["11KP","２０日〆３５日後払",1,25]
["11KQ","２０日〆３６日後払",1,26]
["11KV","２０日〆４０日後払",2,0]
["11P5","２５日〆１０日後払",1,5]
["11PA","２５日〆１５日後払",1,10]
["11PF","２５日〆２０日後払",1,15]
["11PI","２５日〆２３日後（１８日）払",1,18]
["11PK","２５日〆２５日後払",1,20]
["11PL","２５日〆２６日後払",1,21]
["11PN","２５日〆２８日後払",1,23]
["11PP","２５日〆３０日後払",1,25]
["11PQ","２５日〆３１日後払",1,26]
["11PV","２５日〆３５日後払",2,0]
["11QQ","２６日〆３０日後払",1,26]
["11RV","２７日〆３３日後払",2,0]
["11SS","２８日〆３０日後払",1,28]
["11TV","２９日〆３１日後払",2,0]
["11V2","月末〆２日後払",1,2]
["11V3","月末〆３日後払",1,3]
["11V5","月末〆５日後払",1,5]
["11V7","月末〆７日後払",1,7]
["11VA","月末〆１０日後払",1,10]
["11VC","月末〆１２日後払",1,12]
["11VF","月末〆１５日後払",1,15]
["11VH","月末〆１７日後払",1,17]
["11VI","月末〆１８日後払",1,18]
["11VK","月末〆２０日後払",1,20]
["11VM","月末〆２２日後払",1,22]
["11VN","月末〆２３日後払",1,23]
["11VO","月末〆２４日後払",1,24]
["11VP","月末〆２５日後払",1,25]
["11VQ","月末〆２６日後払",1,26]
["11VR","月末〆２７日後払",1,27]
["11VS","月末〆２８日後払",1,28]
["11VT","月末〆２９日後払",1,29]
["11VV","月末〆３０日後払",2,0]
[1255,"５日〆６０日後払",2,5]
["12AA","１０日〆６０日後払",2,10]
["12AK","１０日〆７０日後払",2,20]
["12AV","１０日〆８０日後払",3,0]
["12F5","１５日〆５０日後払",2,5]
["12FA","１５日〆５５日後払",2,10]
["12FD","１５日〆５８日後払",2,13]
["12FI","１５日〆６３日後払",2,18]
["12FV","１５日〆７５日後払",3,0]
["12K5","２０日〆４５日後払",2,5]
["12KA","２０日〆５０日後払",2,10]
["12KF","２０日〆５５日後払",2,15]
["12KK","２０日〆６０日後払",2,20]
["12KP","２０日〆６５日後払",2,25]
["12KV","２０日〆７０日後払",3,0]
["12P5","２５日〆４０日後払",2,5]
["12PA","２５日〆４５日後払",2,10]
["12PF","２５日〆５０日後払",2,15]
["12PK","２５日〆５５日後払",2,20]
["12PP","２５日〆６０日後払",2,25]
["12PV","２５日〆６５日後払",3,0]
["12V1","月末〆３１日後払",2,1]
["12V5","月末〆３５日後払",2,5]
["12V6","月末〆３６日後払",2,6]
["12V7","月末〆３７日後払",2,7]
["12V8","月末〆３８日後払",2,8]
["12VA","月末〆４０日後払",2,10]
["12VB","月末〆４１日後払",2,11]
["12VC","月末〆４２日後払",2,12]
["12VF","月末〆４５日後払",2,15]
["12VG","月末〆４６日後払",2,16]
["12VH","月末〆４７日後払",2,17]
["12VJ","月末〆４９日後払",2,19]
["12VK","月末〆５０日後払",2,20]
["12VM","月末〆５２日後払",2,22]
["12VN","月末〆５３日後払",2,23]
["12VP","月末〆５５日後払",2,25]
["12VQ","月末〆５６日後払",2,26]
["12VR","月末〆５７日後払",2,27]
["12VS","月末〆５８日後払",2,28]
["12VV","月末〆６０日後払",3,0]
["13FK","１５日〆９５日後払",3,20]
["13KA","２０日〆８０日後払",3,10]
["13KF","２０日〆８５日後払",3,15]
["13KV","２０日〆１００日後払",4,0]
["13PP","２５日〆９０日後払",3,25]
["13PV","２５日〆９５日後払",3,0]
["13V1","月末〆６１日後払",3,1]
["13V2","月末〆６２日後払",3,2]
["13V5","月末〆６５日後払",3,5]
["13VA","月末〆７０日後払",3,10]
["13VC","月末〆７２日後払",3,12]
["13VF","月末〆７５日後払",3,15]
["13VH","月末〆７７日後払",3,17]
["13VK","月末〆８０日後払",3,20]
["13VP","月末〆８５日後払",3,25]
["13VV","月末〆９０日後払",4,0]
["14AA","１０日〆１２０日後払",4,10]
["14FF","１５日〆１２０日後払",4,15]
["14K5","２０日〆１０５日後払",4,5]
["14PP","２５日〆１２０日後払",4,25]
["14V5","月末〆９５日後払",4,5]
["14VA","月末〆１００日後払",4,10]
["14VC","月末〆１０２日後払",4,12]
["14VP","月末〆１１５日後払",4,25]
["14VV","月末〆１２０日後払",5,0]
["15KV","２０日〆１６０日後払",6,0]
["15V5","月末〆１２５日後払",5,25]
["15VV","月末〆１５０日後払",6,0]
["16KB","２０日〆１７１日後払",6,11]
["16V5","月末〆１５５日後払",6,5]
["16VV","月末〆１８０日後払",7,0]
["Z003","計上３日後",0,3]
["Z007","計上７日後",0,7]
["Z010","計上１０日後",0,10]
["Z014","計上１４日後",0,14]
["Z020","計上２０日後",0,20]
["Z030","計上３０日後",1,0]
["Z060","計上６０日後",2,0]

{"sheet":"データ取込","index":5,"n_rows":121,"n_cols":10,"rows_kept":121,"cut":false,"hidden":false,"merged":[]}
["仕入先コード","仕入集計金額","仕入消費税金額","仕入先コード（SAP）","仕入先名称","省略名称","支払条件（月）","支払条件（日）","消費税率","消費税コード"]
["0000000000017",1811352,144909,{"$f":"IF(A2=\"\",\"\",IFERROR(VLOOKUP(A2,Suppliers[],2,0),\"未登録\"))","v":"KN-000017"},{"$f":"IF(A2=\"\",\"\",IFERROR(VLOOKUP($A2,Suppliers[],3,0),\"未登録\"))","v":"三井物産㈱油脂・加工開発営業室"},{"$f":"IF(A2=\"\",\"\",IFERROR(VLOOKUP($A2,Suppliers[],4,0),\"未登録\"))","v":"三井物産(油脂加工)"},{"$f":"IFERROR(VLOOKUP(A2,Suppliers[],8,0),\"\")","v":3},{"$f":"IFERROR(VLOOKUP(A2,Suppliers[],9,0),\"\")","v":15},{"$f":"IFERROR(ROUND(OriginalData[[#This Row],[仕入消費税金額]]/OriginalData[[#This Row],[仕入集計金額]],2),\"\")","v":0.08},{"$f":"IF(OriginalData[[#This Row],[消費税率]]=0.08,\"K8\",IF(OriginalData[[#This Row],[消費税率]]=0.1,\"AA\",\"\"))","v":"K8"}]
["0000000000081",89902,7252,{"$f":"IF(A3=\"\",\"\",IFERROR(VLOOKUP(A3,Suppliers[],2,0),\"未登録\"))","v":"KN-000081"},{"$f":"IF(A3=\"\",\"\",IFERROR(VLOOKUP($A3,Suppliers[],3,0),\"未登録\"))","v":"隅田商事㈱"},{"$f":"IF(A3=\"\",\"\",IFERROR(VLOOKUP($A3,Suppliers[],4,0),\"未登録\"))","v":"隅田商事"},{"$f":"IFERROR(VLOOKUP(A3,Suppliers[],8,0),\"\")","v":2},{"$f":"IFERROR(VLOOKUP(A3,Suppliers[],9,0),\"\")","v":0},null,{"$f":"IF(OriginalData[[#This Row],[消費税率]]=0.08,\"K8\",IF(OriginalData[[#This Row],[消費税率]]=0.1,\"AA\",\"\"))","v":""}]
["0000000000123",8554275,684342,{"$f":"IF(A4=\"\",\"\",IFERROR(VLOOKUP(A4,Suppliers[],2,0),\"未登録\"))","v":"KN-000123"},{"$f":"IF(A4=\"\",\"\",IFERROR(VLOOKUP($A4,Suppliers[],3,0),\"未登録\"))","v":"三菱商事㈱ （はくばく・粉）"},{"$f":"IF(A4=\"\",\"\",IFERROR(VLOOKUP($A4,Suppliers[],4,0),\"未登録\"))","v":"三菱商事(はくばく)"},{"$f":"IFERROR(VLOOKUP(A4,Suppliers[],8,0),\"\")","v":2},{"$f":"IFERROR(VLOOKUP(A4,Suppliers[],9,0),\"\")","v":0},{"$f":"IFERROR(ROUND(OriginalData[[#This Row],[仕入消費税金額]]/OriginalData[[#This Row],[仕入集計金額]],2),\"\")","v":0.08},{"$f":"IF(OriginalData[[#This Row],[消費税率]]=0.08,\"K8\",IF(OriginalData[[#This Row],[消費税率]]=0.1,\"AA\",\"\"))","v":"K8"}]
["0000000000154",9892,791,{"$f":"IF(A5=\"\",\"\",IFERROR(VLOOKUP(A5,Suppliers[],2,0),\"未登録\"))","v":"KN-000154"},{"$f":"IF(A5=\"\",\"\",IFERROR(VLOOKUP($A5,Suppliers[],3,0),\"未登録\"))","v":"三菱商事㈱（鳥越製粉）"},{"$f":"IF(A5=\"\",\"\",IFERROR(VLOOKUP($A5,Suppliers[],4,0),\"未登録\"))","v":"三菱商事(鳥越製粉)"},{"$f":"IFERROR(VLOOKUP(A5,Suppliers[],8,0),\"\")","v":2},{"$f":"IFERROR(VLOOKUP(A5,Suppliers[],9,0),\"\")","v":0},{"$f":"IFERROR(ROUND(OriginalData[[#This Row],[仕入消費税金額]]/OriginalData[[#This Row],[仕入集計金額]],2),\"\")","v":0.08},{"$f":"IF(OriginalData[[#This Row],[消費税率]]=0.08,\"K8\",IF(OriginalData[[#This Row],[消費税率]]=0.1,\"AA\",\"\"))","v":"K8"}]
["0000000000215",6934586,554766,{"$f":"IF(A6=\"\",\"\",IFERROR(VLOOKUP(A6,Suppliers[],2,0),\"未登録\"))","v":"KN-000215"},{"$f":"IF(A6=\"\",\"\",IFERROR(VLOOKUP($A6,Suppliers[],3,0),\"未登録\"))","v":"㈱ニップン商事コ－ポレ－ション"},{"$f":"IF(A6=\"\",\"\",IFERROR(VLOOKUP($A6,Suppliers[],4,0),\"未登録\"))","v":"ニップン商事"},{"$f":"IFERROR(VLOOKUP(A6,Suppliers[],8,0),\"\")","v":2},{"$f":"IFERROR(VLOOKUP(A6,Suppliers[],9,0),\"\")","v":0},{"$f":"IFERROR(ROUND(OriginalData[[#This Row],[仕入消費税金額]]/OriginalData[[#This Row],[仕入集計金額]],2),\"\")","v":0.08},{"$f":"IF(OriginalData[[#This Row],[消費税率]]=0.08,\"K8\",IF(OriginalData[[#This Row],[消費税率]]=0.1,\"AA\",\"\"))","v":"K8"}]
["0000000000253",134170,10734,{"$f":"IF(A7=\"\",\"\",IFERROR(VLOOKUP(A7,Suppliers[],2,0),\"未登録\"))","v":"KN-000253"},{"$f":"IF(A7=\"\",\"\",IFERROR(VLOOKUP($A7,Suppliers[],3,0),\"未登録\"))","v":"三菱商事ﾗｲﾌｻｲｴﾝｽ㈱"},{"$f":"IF(A7=\"\",\"\",IFERROR(VLOOKUP($A7,Suppliers[],4,0),\"未登録\"))","v":"三菱商事ﾗｲﾌｻｲｴﾝｽ"},{"$f":"IFERROR(VLOOKUP(A7,Suppliers[],8,0),\"\")","v":3},{"$f":"IFERROR(VLOOKUP(A7,Suppliers[],9,0),\"\")","v":0},{"$f":"IFERROR(ROUND(OriginalData[[#This Row],[仕入消費税金額]]/OriginalData[[#This Row],[仕入集計金額]],2),\"\")","v":0.08},{"$f":"IF(OriginalData[[#This Row],[消費税率]]=0.08,\"K8\",IF(OriginalData[[#This Row],[消費税率]]=0.1,\"AA\",\"\"))","v":"K8"}]
["0000000000270",0,0,{"$f":"IF(A8=\"\",\"\",IFERROR(VLOOKUP(A8,Suppliers[],2,0),\"未登録\"))","v":"KN-000270"},{"$f":"IF(A8=\"\",\"\",IFERROR(VLOOKUP($A8,Suppliers[],3,0),\"未登録\"))","v":"かちどき製粉㈱"},{"$f":"IF(A8=\"\",\"\",IFERROR(VLOOKUP($A8,Suppliers[],4,0),\"未登録\"))","v":"かちどき製粉"},{"$f":"IFERROR(VLOOKUP(A8,Suppliers[],8,0),\"\")","v":2},{"$f":"IFERROR(VLOOKUP(A8,Suppliers[],9,0),\"\")","v":0},{"$f":"IFERROR(ROUND(OriginalData[[#This Row],[仕入消費税金額]]/OriginalData[[#This Row],[仕入集計金額]],2),\"\")","v":""},{"$f":"IF(OriginalData[[#This Row],[消費税率]]=0.08,\"K8\",IF(OriginalData[[#This Row],[消費税率]]=0.1,\"AA\",\"\"))","v":""}]
["0000000001111",4770,382,{"$f":"IF(A9=\"\",\"\",IFERROR(VLOOKUP(A9,Suppliers[],2,0),\"未登録\"))","v":"KN-001111"},{"$f":"IF(A9=\"\",\"\",IFERROR(VLOOKUP($A9,Suppliers[],3,0),\"未登録\"))","v":"㈱長谷川商店"},{"$f":"IF(A9=\"\",\"\",IFERROR(VLOOKUP($A9,Suppliers[],4,0),\"未登録\"))","v":"長谷川商店"},{"$f":"IFERROR(VLOOKUP(A9,Suppliers[],8,0),\"\")","v":2},{"$f":"IFERROR(VLOOKUP(A9,Suppliers[],9,0),\"\")","v":0},{"$f":"IFERROR(ROUND(OriginalData[[#This Row],[仕入消費税金額]]/OriginalData[[#This Row],[仕入集計金額]],2),\"\")","v":0.08},{"$f":"IF(OriginalData[[#This Row],[消費税率]]=0.08,\"K8\",IF(OriginalData[[#This Row],[消費税率]]=0.1,\"AA\",\"\"))","v":"K8"}]
["0000000001131",69000,5520,{"$f":"IF(A10=\"\",\"\",IFERROR(VLOOKUP(A10,Suppliers[],2,0),\"未登録\"))","v":"KN-001131"},{"$f":"IF(A10=\"\",\"\",IFERROR(VLOOKUP($A10,Suppliers[],3,0),\"未登録\"))","v":"コ－ビオンジャパン㈱"},{"$f":"IF(A10=\"\",\"\",IFERROR(VLOOKUP($A10,Suppliers[],4,0),\"未登録\"))","v":"コ－ビオンジャパン"},{"$f":"IFERROR(VLOOKUP(A10,Suppliers[],8,0),\"\")","v":3},{"$f":"IFERROR(VLOOKUP(A10,Suppliers[],9,0),\"\")","v":0},{"$f":"IFERROR(ROUND(OriginalData[[#This Row],[仕入消費税金額]]/OriginalData[[#This Row],[仕入集計金額]],2),\"\")","v":0.08},{"$f":"IF(OriginalData[[#This Row],[消費税率]]=0.08,\"K8\",IF(OriginalData[[#This Row],[消費税率]]=0.1,\"AA\",\"\"))","v":"K8"}]
["0000000001171",343600,27488,{"$f":"IF(A11=\"\",\"\",IFERROR(VLOOKUP(A11,Suppliers[],2,0),\"未登録\"))","v":"KN-001171"},{"$f":"IF(A11=\"\",\"\",IFERROR(VLOOKUP($A11,Suppliers[],3,0),\"未登録\"))","v":"理研ビタミン㈱"},{"$f":"IF(A11=\"\",\"\",IFERROR(VLOOKUP($A11,Suppliers[],4,0),\"未登録\"))","v":"理研ビタミン"},{"$f":"IFERROR(VLOOKUP(A11,Suppliers[],8,0),\"\")","v":3},{"$f":"IFERROR(VLOOKUP(A11,Suppliers[],9,0),\"\")","v":0},{"$f":"IFERROR(ROUND(OriginalData[[#This Row],[仕入消費税金額]]/OriginalData[[#This Row],[仕入集計金額]],2),\"\")","v":0.08},{"$f":"IF(OriginalData[[#This Row],[消費税率]]=0.08,\"K8\",IF(OriginalData[[#This Row],[消費税率]]=0.1,\"AA\",\"\"))","v":"K8"}]
["0000000001355",43790,3503,{"$f":"IF(A12=\"\",\"\",IFERROR(VLOOKUP(A12,Suppliers[],2,0),\"未登録\"))","v":"KN-001355"},{"$f":"IF(A12=\"\",\"\",IFERROR(VLOOKUP($A12,Suppliers[],3,0),\"未登録\"))","v":"三井物産㈱　オ－マイ製品"},{"$f":"IF(A12=\"\",\"\",IFERROR(VLOOKUP($A12,Suppliers[],4,0),\"未登録\"))","v":"三井物産(オ－マイ)"},{"$f":"IFERROR(VLOOKUP(A12,Suppliers[],8,0),\"\")","v":3},{"$f":"IFERROR(VLOOKUP(A12,Suppliers[],9,0),\"\")","v":0},{"$f":"IFERROR(ROUND(OriginalData[[#This Row],[仕入消費税金額]]/OriginalData[[#This Row],[仕入集計金額]],2),\"\")","v":0.08},{"$f":"IF(OriginalData[[#This Row],[消費税率]]=0.08,\"K8\",IF(OriginalData[[#This Row],[消費税率]]=0.1,\"AA\",\"\"))","v":"K8"}]
["0000000001430",102821,8274,{"$f":"IF(A13=\"\",\"\",IFERROR(VLOOKUP(A13,Suppliers[],2,0),\"未登録\"))","v":"KN-001430"},{"$f":"IF(A13=\"\",\"\",IFERROR(VLOOKUP($A13,Suppliers[],3,0),\"未登録\"))","v":"㈱はくばく"},{"$f":"IF(A13=\"\",\"\",IFERROR(VLOOKUP($A13,Suppliers[],4,0),\"未登録\"))","v":"はくばく"},{"$f":"IFERROR(VLOOKUP(A13,Suppliers[],8,0),\"\")","v":2},{"$f":"IFERROR(VLOOKUP(A13,Suppliers[],9,0),\"\")","v":15},{"$f":"IFERROR(ROUND(OriginalData[[#This Row],[仕入消費税金額]]/OriginalData[[#This Row],[仕入集計金額]],2),\"\")","v":0.08},{"$f":"IF(OriginalData[[#This Row],[消費税率]]=0.08,\"K8\",IF(OriginalData[[#This Row],[消費税率]]=0.1,\"AA\",\"\"))","v":"K8"}]
["0000000001451",0,0,{"$f":"IF(A14=\"\",\"\",IFERROR(VLOOKUP(A14,Suppliers[],2,0),\"未登録\"))","v":"KN-001451"},{"$f":"IF(A14=\"\",\"\",IFERROR(VLOOKUP($A14,Suppliers[],3,0),\"未登録\"))","v":"東京保存食糧㈱"},{"$f":"IF(A14=\"\",\"\",IFERROR(VLOOKUP($A14,Suppliers[],4,0),\"未登録\"))","v":"東京保存食糧"},{"$f":"IFERROR(VLOOKUP(A14,Suppliers[],8,0),\"\")","v":1},{"$f":"IFERROR(VLOOKUP(A14,Suppliers[],9,0),\"\")","v":20},{"$f":"IFERROR(ROUND(OriginalData[[#This Row],[仕入消費税金額]]/OriginalData[[#This Row],[仕入集計金額]],2),\"\")","v":""},{"$f":"IF(OriginalData[[#This Row],[消費税率]]=0.08,\"K8\",IF(OriginalData[[#This Row],[消費税率]]=0.1,\"AA\",\"\"))","v":""}]
["0000000001577",167377,13406,{"$f":"IF(A15=\"\",\"\",IFERROR(VLOOKUP(A15,Suppliers[],2,0),\"未登録\"))","v":"KN-001577"},{"$f":"IF(A15=\"\",\"\",IFERROR(VLOOKUP($A15,Suppliers[],3,0),\"未登録\"))","v":"川光商事㈱"},{"$f":"IF(A15=\"\",\"\",IFERROR(VLOOKUP($A15,Suppliers[],4,0),\"未登録\"))","v":"川光商事"},{"$f":"IFERROR(VLOOKUP(A15,Suppliers[],8,0),\"\")","v":3},{"$f":"IFERROR(VLOOKUP(A15,Suppliers[],9,0),\"\")","v":0},{"$f":"IFERROR(ROUND(OriginalData[[#This Row],[仕入消費税金額]]/OriginalData[[#This Row],[仕入集計金額]],2),\"\")","v":0.08},{"$f":"IF(OriginalData[[#This Row],[消費税率]]=0.08,\"K8\",IF(OriginalData[[#This Row],[消費税率]]=0.1,\"AA\",\"\"))","v":"K8"}]
["0000000001621",1806860,144554,{"$f":"IF(A16=\"\",\"\",IFERROR(VLOOKUP(A16,Suppliers[],2,0),\"未登録\"))","v":"KN-001621"},{"$f":"IF(A16=\"\",\"\",IFERROR(VLOOKUP($A16,Suppliers[],3,0),\"未登録\"))","v":"三井物産㈱　富士食品製品"},{"$f":"IF(A16=\"\",\"\",IFERROR(VLOOKUP($A16,Suppliers[],4,0),\"未登録\"))","v":"三井物産(富士食品)"},{"$f":"IFERROR(VLOOKUP(A16,Suppliers[],8,0),\"\")","v":3},{"$f":"IFERROR(VLOOKUP(A16,Suppliers[],9,0),\"\")","v":0},{"$f":"IFERROR(ROUND(OriginalData[[#This Row],[仕入消費税金額]]/OriginalData[[#This Row],[仕入集計金額]],2),\"\")","v":0.08},{"$f":"IF(OriginalData[[#This Row],[消費税率]]=0.08,\"K8\",IF(OriginalData[[#This Row],[消費税率]]=0.1,\"AA\",\"\"))","v":"K8"}]
["0000000001645",12750,1040,{"$f":"IF(A17=\"\",\"\",IFERROR(VLOOKUP(A17,Suppliers[],2,0),\"未登録\"))","v":"KN-001645"},{"$f":"IF(A17=\"\",\"\",IFERROR(VLOOKUP($A17,Suppliers[],3,0),\"未登録\"))","v":"㈱創味食品"},{"$f":"IF(A17=\"\",\"\",IFERROR(VLOOKUP($A17,Suppliers[],4,0),\"未登録\"))","v":"創味食品"},{"$f":"IFERROR(VLOOKUP(A17,Suppliers[],8,0),\"\")","v":3},{"$f":"IFERROR(VLOOKUP(A17,Suppliers[],9,0),\"\")","v":0},{"$f":"IFERROR(ROUND(OriginalData[[#This Row],[仕入消費税金額]]/OriginalData[[#This Row],[仕入集計金額]],2),\"\")","v":0.08},{"$f":"IF(OriginalData[[#This Row],[消費税率]]=0.08,\"K8\",IF(OriginalData[[#This Row],[消費税率]]=0.1,\"AA\",\"\"))","v":"K8"}]
["0000000001720",20720,1695,{"$f":"IF(A18=\"\",\"\",IFERROR(VLOOKUP(A18,Suppliers[],2,0),\"未登録\"))","v":"KN-001720"},{"$f":"IF(A18=\"\",\"\",IFERROR(VLOOKUP($A18,Suppliers[],3,0),\"未登録\"))","v":"丸和油脂㈱"},{"$f":"IF(A18=\"\",\"\",IFERROR(VLOOKUP($A18,Suppliers[],4,0),\"未登録\"))","v":"丸和油脂"},{"$f":"IFERROR(VLOOKUP(A18,Suppliers[],8,0),\"\")","v":3},{"$f":"IFERROR(VLOOKUP(A18,Suppliers[],9,0),\"\")","v":0},{"$f":"IFERROR(ROUND(OriginalData[[#This Row],[仕入消費税金額]]/OriginalData[[#This Row],[仕入集計金額]],2),\"\")","v":0.08},{"$f":"IF(OriginalData[[#This Row],[消費税率]]=0.08,\"K8\",IF(OriginalData[[#This Row],[消費税率]]=0.1,\"AA\",\"\"))","v":"K8"}]
["0000000001741",0,0,{"$f":"IF(A19=\"\",\"\",IFERROR(VLOOKUP(A19,Suppliers[],2,0),\"未登録\"))","v":"KN-001741"},{"$f":"IF(A19=\"\",\"\",IFERROR(VLOOKUP($A19,Suppliers[],3,0),\"未登録\"))","v":"和弘食品㈱"},{"$f":"IF(A19=\"\",\"\",IFERROR(VLOOKUP($A19,Suppliers[],4,0),\"未登録\"))","v":"和弘食品"},{"$f":"IFERROR(VLOOKUP(A19,Suppliers[],8,0),\"\")","v":3},{"$f":"IFERROR(VLOOKUP(A19,Suppliers[],9,0),\"\")","v":0},{"$f":"IFERROR(ROUND(OriginalData[[#This Row],[仕入消費税金額]]/OriginalData[[#This Row],[仕入集計金額]],2),\"\")","v":""},{"$f":"IF(OriginalData[[#This Row],[消費税率]]=0.08,\"K8\",IF(OriginalData[[#This Row],[消費税率]]=0.1,\"AA\",\"\"))","v":""}]
["0000000001775",406331,32506,{"$f":"IF(A20=\"\",\"\",IFERROR(VLOOKUP(A20,Suppliers[],2,0),\"未登録\"))","v":"KN-001775"},{"$f":"IF(A20=\"\",\"\",IFERROR(VLOOKUP($A20,Suppliers[],3,0),\"未登録\"))","v":"国分首都圏株式会社"},{"$f":"IF(A20=\"\",\"\",IFERROR(VLOOKUP($A20,Suppliers[],4,0),\"未登録\"))","v":"国分首都圏"},{"$f":"IFERROR(VLOOKUP(A20,Suppliers[],8,0),\"\")","v":3},{"$f":"IFERROR(VLOOKUP(A20,Suppliers[],9,0),\"\")","v":0},{"$f":"IFERROR(ROUND(OriginalData[[#This Row],[仕入消費税金額]]/OriginalData[[#This Row],[仕入集計金額]],2),\"\")","v":0.08},{"$f":"IF(OriginalData[[#This Row],[消費税率]]=0.08,\"K8\",IF(OriginalData[[#This Row],[消費税率]]=0.1,\"AA\",\"\"))","v":"K8"}]
["0000000001959",730020,58395,{"$f":"IF(A21=\"\",\"\",IFERROR(VLOOKUP(A21,Suppliers[],2,0),\"未登録\"))","v":"KN-001959"},{"$f":"IF(A21=\"\",\"\",IFERROR(VLOOKUP($A21,Suppliers[],3,0),\"未登録\"))","v":"㈱日本サンガリア"},{"$f":"IF(A21=\"\",\"\",IFERROR(VLOOKUP($A21,Suppliers[],4,0),\"未登録\"))","v":"日本サンガリア"},{"$f":"IFERROR(VLOOKUP(A21,Suppliers[],8,0),\"\")","v":2},{"$f":"IFERROR(VLOOKUP(A21,Suppliers[],9,0),\"\")","v":0},{"$f":"IFERROR(ROUND(OriginalData[[#This Row],[仕入消費税金額]]/OriginalData[[#This Row],[仕入集計金額]],2),\"\")","v":0.08},{"$f":"IF(OriginalData[[#This Row],[消費税率]]=0.08,\"K8\",IF(OriginalData[[#This Row],[消費税率]]=0.1,\"AA\",\"\"))","v":"K8"}]
["0000000002013",986910,78953,{"$f":"IF(A22=\"\",\"\",IFERROR(VLOOKUP(A22,Suppliers[],2,0),\"未登録\"))","v":"KN-002013"},{"$f":"IF(A22=\"\",\"\",IFERROR(VLOOKUP($A22,Suppliers[],3,0),\"未登録\"))","v":"三井物産㈱Ｊ－オイルミルズ"},{"$f":"IF(A22=\"\",\"\",IFERROR(VLOOKUP($A22,Suppliers[],4,0),\"未登録\"))","v":"三井物産(ｵｲﾙﾐﾙｽﾞ)"},{"$f":"IFERROR(VLOOKUP(A22,Suppliers[],8,0),\"\")","v":3},{"$f":"IFERROR(VLOOKUP(A22,Suppliers[],9,0),\"\")","v":0},{"$f":"IFERROR(ROUND(OriginalData[[#This Row],[仕入消費税金額]]/OriginalData[[#This Row],[仕入集計金額]],2),\"\")","v":0.08},{"$f":"IF(OriginalData[[#This Row],[消費税率]]=0.08,\"K8\",IF(OriginalData[[#This Row],[消費税率]]=0.1,\"AA\",\"\"))","v":"K8"}]
["0000000002037",854380,68347,{"$f":"IF(A23=\"\",\"\",IFERROR(VLOOKUP(A23,Suppliers[],2,0),\"未登録\"))","v":"KN-002037"},{"$f":"IF(A23=\"\",\"\",IFERROR(VLOOKUP($A23,Suppliers[],3,0),\"未登録\"))","v":"岩井の胡麻油㈱"},{"$f":"IF(A23=\"\",\"\",IFERROR(VLOOKUP($A23,Suppliers[],4,0),\"未登録\"))","v":"岩井の胡麻油"},{"$f":"IFERROR(VLOOKUP(A23,Suppliers[],8,0),\"\")","v":3},{"$f":"IFERROR(VLOOKUP(A23,Suppliers[],9,0),\"\")","v":0},{"$f":"IFERROR(ROUND(OriginalData[[#This Row],[仕入消費税金額]]/OriginalData[[#This Row],[仕入集計金額]],2),\"\")","v":0.08},{"$f":"IF(OriginalData[[#This Row],[消費税率]]=0.08,\"K8\",IF(OriginalData[[#This Row],[消費税率]]=0.1,\"AA\",\"\"))","v":"K8"}]
["0000000002044",85400,6832,{"$f":"IF(A24=\"\",\"\",IFERROR(VLOOKUP(A24,Suppliers[],2,0),\"未登録\"))","v":"KN-002044"},{"$f":"IF(A24=\"\",\"\",IFERROR(VLOOKUP($A24,Suppliers[],3,0),\"未登録\"))","v":"三井物産㈱　かどや製油"},{"$f":"IF(A24=\"\",\"\",IFERROR(VLOOKUP($A24,Suppliers[],4,0),\"未登録\"))","v":"三井物産(かどや)"},{"$f":"IFERROR(VLOOKUP(A24,Suppliers[],8,0),\"\")","v":3},{"$f":"IFERROR(VLOOKUP(A24,Suppliers[],9,0),\"\")","v":0},{"$f":"IFERROR(ROUND(OriginalData[[#This Row],[仕入消費税金額]]/OriginalData[[#This Row],[仕入集計金額]],2),\"\")","v":0.08},{"$f":"IF(OriginalData[[#This Row],[消費税率]]=0.08,\"K8\",IF(OriginalData[[#This Row],[消費税率]]=0.1,\"AA\",\"\"))","v":"K8"}]
["0000000002075",419900,33592,{"$f":"IF(A25=\"\",\"\",IFERROR(VLOOKUP(A25,Suppliers[],2,0),\"未登録\"))","v":"KN-002075"},{"$f":"IF(A25=\"\",\"\",IFERROR(VLOOKUP($A25,Suppliers[],3,0),\"未登録\"))","v":"ユアサ・フナショク株式会社"},{"$f":"IF(A25=\"\",\"\",IFERROR(VLOOKUP($A25,Suppliers[],4,0),\"未登録\"))","v":"ユアサ・フナショク"},{"$f":"IFERROR(VLOOKUP(A25,Suppliers[],8,0),\"\")","v":1},{"$f":"IFERROR(VLOOKUP(A25,Suppliers[],9,0),\"\")","v":0},{"$f":"IFERROR(ROUND(OriginalData[[#This Row],[仕入消費税金額]]/OriginalData[[#This Row],[仕入集計金額]],2),\"\")","v":0.08},{"$f":"IF(OriginalData[[#This Row],[消費税率]]=0.08,\"K8\",IF(OriginalData[[#This Row],[消費税率]]=0.1,\"AA\",\"\"))","v":"K8"}]
["0000000002150",25000,2000,{"$f":"IF(A26=\"\",\"\",IFERROR(VLOOKUP(A26,Suppliers[],2,0),\"未登録\"))","v":"KN-002150"},{"$f":"IF(A26=\"\",\"\",IFERROR(VLOOKUP($A26,Suppliers[],3,0),\"未登録\"))","v":"㈱ダイヤスター"},{"$f":"IF(A26=\"\",\"\",IFERROR(VLOOKUP($A26,Suppliers[],4,0),\"未登録\"))","v":"ダイヤスター"},{"$f":"IFERROR(VLOOKUP(A26,Suppliers[],8,0),\"\")","v":3},{"$f":"IFERROR(VLOOKUP(A26,Suppliers[],9,0),\"\")","v":0},{"$f":"IFERROR(ROUND(OriginalData[[#This Row],[仕入消費税金額]]/OriginalData[[#This Row],[仕入集計金額]],2),\"\")","v":0.08},{"$f":"IF(OriginalData[[#This Row],[消費税率]]=0.08,\"K8\",IF(OriginalData[[#This Row],[消費税率]]=0.1,\"AA\",\"\"))","v":"K8"}]
["0000000002198",0,0,{"$f":"IF(A27=\"\",\"\",IFERROR(VLOOKUP(A27,Suppliers[],2,0),\"未登録\"))","v":"KN-002198"},{"$f":"IF(A27=\"\",\"\",IFERROR(VLOOKUP($A27,Suppliers[],3,0),\"未登録\"))","v":"㈱内田からし"},{"$f":"IF(A27=\"\",\"\",IFERROR(VLOOKUP($A27,Suppliers[],4,0),\"未登録\"))","v":"内田からし"},{"$f":"IFERROR(VLOOKUP(A27,Suppliers[],8,0),\"\")","v":2},{"$f":"IFERROR(VLOOKUP(A27,Suppliers[],9,0),\"\")","v":0},{"$f":"IFERROR(ROUND(OriginalData[[#This Row],[仕入消費税金額]]/OriginalData[[#This Row],[仕入集計金額]],2),\"\")","v":""},{"$f":"IF(OriginalData[[#This Row],[消費税率]]=0.08,\"K8\",IF(OriginalData[[#This Row],[消費税率]]=0.1,\"AA\",\"\"))","v":""}]
["0000000002235",116200,9296,{"$f":"IF(A28=\"\",\"\",IFERROR(VLOOKUP(A28,Suppliers[],2,0),\"未登録\"))","v":"KN-002235"},{"$f":"IF(A28=\"\",\"\",IFERROR(VLOOKUP($A28,Suppliers[],3,0),\"未登録\"))","v":"上越スタ－チ㈱"},{"$f":"IF(A28=\"\",\"\",IFERROR(VLOOKUP($A28,Suppliers[],4,0),\"未登録\"))","v":"上越スタ－チ"},{"$f":"IFERROR(VLOOKUP(A28,Suppliers[],8,0),\"\")","v":3},{"$f":"IFERROR(VLOOKUP(A28,Suppliers[],9,0),\"\")","v":0},{"$f":"IFERROR(ROUND(OriginalData[[#This Row],[仕入消費税金額]]/OriginalData[[#This Row],[仕入集計金額]],2),\"\")","v":0.08},{"$f":"IF(OriginalData[[#This Row],[消費税率]]=0.08,\"K8\",IF(OriginalData[[#This Row],[消費税率]]=0.1,\"AA\",\"\"))","v":"K8"}]
["0000000002265",8000,664,{"$f":"IF(A29=\"\",\"\",IFERROR(VLOOKUP(A29,Suppliers[],2,0),\"未登録\"))","v":"KN-002265"},{"$f":"IF(A29=\"\",\"\",IFERROR(VLOOKUP($A29,Suppliers[],3,0),\"未登録\"))","v":"たかい食品㈱"},{"$f":"IF(A29=\"\",\"\",IFERROR(VLOOKUP($A29,Suppliers[],4,0),\"未登録\"))","v":"たかい食品"},{"$f":"IFERROR(VLOOKUP(A29,Suppliers[],8,0),\"\")","v":2},{"$f":"IFERROR(VLOOKUP(A29,Suppliers[],9,0),\"\")","v":0},{"$f":"IFERROR(ROUND(OriginalData[[#This Row],[仕入消費税金額]]/OriginalData[[#This Row],[仕入集計金額]],2),\"\")","v":0.08},{"$f":"IF(OriginalData[[#This Row],[消費税率]]=0.08,\"K8\",IF(OriginalData[[#This Row],[消費税率]]=0.1,\"AA\",\"\"))","v":"K8"}]
["0000000002297",0,0,{"$f":"IF(A30=\"\",\"\",IFERROR(VLOOKUP(A30,Suppliers[],2,0),\"未登録\"))","v":"KN-002297"},{"$f":"IF(A30=\"\",\"\",IFERROR(VLOOKUP($A30,Suppliers[],3,0),\"未登録\"))","v":"兼松食品㈱"},{"$f":"IF(A30=\"\",\"\",IFERROR(VLOOKUP($A30,Suppliers[],4,0),\"未登録\"))","v":"兼松食品"},{"$f":"IFERROR(VLOOKUP(A30,Suppliers[],8,0),\"\")","v":2},{"$f":"IFERROR(VLOOKUP(A30,Suppliers[],9,0),\"\")","v":15},{"$f":"IFERROR(ROUND(OriginalData[[#This Row],[仕入消費税金額]]/OriginalData[[#This Row],[仕入集計金額]],2),\"\")","v":""},{"$f":"IF(OriginalData[[#This Row],[消費税率]]=0.08,\"K8\",IF(OriginalData[[#This Row],[消費税率]]=0.1,\"AA\",\"\"))","v":""}]
["0000000002440",64650,5172,{"$f":"IF(A31=\"\",\"\",IFERROR(VLOOKUP(A31,Suppliers[],2,0),\"未登録\"))","v":"KN-002440"},{"$f":"IF(A31=\"\",\"\",IFERROR(VLOOKUP($A31,Suppliers[],3,0),\"未登録\"))","v":"㈱マスキチ"},{"$f":"IF(A31=\"\",\"\",IFERROR(VLOOKUP($A31,Suppliers[],4,0),\"未登録\"))","v":"マスキチ"},{"$f":"IFERROR(VLOOKUP(A31,Suppliers[],8,0),\"\")","v":3},{"$f":"IFERROR(VLOOKUP(A31,Suppliers[],9,0),\"\")","v":0},{"$f":"IFERROR(ROUND(OriginalData[[#This Row],[仕入消費税金額]]/OriginalData[[#This Row],[仕入集計金額]],2),\"\")","v":0.08},{"$f":"IF(OriginalData[[#This Row],[消費税率]]=0.08,\"K8\",IF(OriginalData[[#This Row],[消費税率]]=0.1,\"AA\",\"\"))","v":"K8"}]
["0000000002457",3435300,274824,{"$f":"IF(A32=\"\",\"\",IFERROR(VLOOKUP(A32,Suppliers[],2,0),\"未登録\"))","v":"KN-002457"},{"$f":"IF(A32=\"\",\"\",IFERROR(VLOOKUP($A32,Suppliers[],3,0),\"未登録\"))","v":"横関油脂工業㈱"},{"$f":"IF(A32=\"\",\"\",IFERROR(VLOOKUP($A32,Suppliers[],4,0),\"未登録\"))","v":"横関油脂工業"},{"$f":"IFERROR(VLOOKUP(A32,Suppliers[],8,0),\"\")","v":3},{"$f":"IFERROR(VLOOKUP(A32,Suppliers[],9,0),\"\")","v":0},{"$f":"IFERROR(ROUND(OriginalData[[#This Row],[仕入消費税金額]]/OriginalData[[#This Row],[仕入集計金額]],2),\"\")","v":0.08},{"$f":"IF(OriginalData[[#This Row],[消費税率]]=0.08,\"K8\",IF(OriginalData[[#This Row],[消費税率]]=0.1,\"AA\",\"\"))","v":"K8"}]
["0000000002495",189200,15136,{"$f":"IF(A33=\"\",\"\",IFERROR(VLOOKUP(A33,Suppliers[],2,0),\"未登録\"))","v":"KN-002495"},{"$f":"IF(A33=\"\",\"\",IFERROR(VLOOKUP($A33,Suppliers[],3,0),\"未登録\"))","v":"㈱J-NIKKAﾊﾟｰﾄﾅｰｽﾞ"},{"$f":"IF(A33=\"\",\"\",IFERROR(VLOOKUP($A33,Suppliers[],4,0),\"未登録\"))","v":"J-NIKKAﾊﾟｰﾄﾅｰｽﾞ"},{"$f":"IFERROR(VLOOKUP(A33,Suppliers[],8,0),\"\")","v":3},{"$f":"IFERROR(VLOOKUP(A33,Suppliers[],9,0),\"\")","v":0},{"$f":"IFERROR(ROUND(OriginalData[[#This Row],[仕入消費税金額]]/OriginalData[[#This Row],[仕入集計金額]],2),\"\")","v":0.08},{"$f":"IF(OriginalData[[#This Row],[消費税率]]=0.08,\"K8\",IF(OriginalData[[#This Row],[消費税率]]=0.1,\"AA\",\"\"))","v":"K8"}]
["0000000002549",14847,1187,{"$f":"IF(A34=\"\",\"\",IFERROR(VLOOKUP(A34,Suppliers[],2,0),\"未登録\"))","v":"KN-002549"},{"$f":"IF(A34=\"\",\"\",IFERROR(VLOOKUP($A34,Suppliers[],3,0),\"未登録\"))","v":"㈱鈴木屋"},{"$f":"IF(A34=\"\",\"\",IFERROR(VLOOKUP($A34,Suppliers[],4,0),\"未登録\"))","v":"鈴木屋"},{"$f":"IFERROR(VLOOKUP(A34,Suppliers[],8,0),\"\")","v":3},{"$f":"IFERROR(VLOOKUP(A34,Suppliers[],9,0),\"\")","v":0},{"$f":"IFERROR(ROUND(OriginalData[[#This Row],[仕入消費税金額]]/OriginalData[[#This Row],[仕入集計金額]],2),\"\")","v":0.08},{"$f":"IF(OriginalData[[#This Row],[消費税率]]=0.08,\"K8\",IF(OriginalData[[#This Row],[消費税率]]=0.1,\"AA\",\"\"))","v":"K8"}]
["0000000002756",17000,1360,{"$f":"IF(A35=\"\",\"\",IFERROR(VLOOKUP(A35,Suppliers[],2,0),\"未登録\"))","v":"KN-002756"},{"$f":"IF(A35=\"\",\"\",IFERROR(VLOOKUP($A35,Suppliers[],3,0),\"未登録\"))","v":"二葉化成株式会社"},{"$f":"IF(A35=\"\",\"\",IFERROR(VLOOKUP($A35,Suppliers[],4,0),\"未登録\"))","v":"二葉化成株式会社"},{"$f":"IFERROR(VLOOKUP(A35,Suppliers[],8,0),\"\")","v":2},{"$f":"IFERROR(VLOOKUP(A35,Suppliers[],9,0),\"\")","v":0},{"$f":"IFERROR(ROUND(OriginalData[[#This Row],[仕入消費税金額]]/OriginalData[[#This Row],[仕入集計金額]],2),\"\")","v":0.08},{"$f":"IF(OriginalData[[#This Row],[消費税率]]=0.08,\"K8\",IF(OriginalData[[#This Row],[消費税率]]=0.1,\"AA\",\"\"))","v":"K8"}]
["0000000002884",8000,640,{"$f":"IF(A36=\"\",\"\",IFERROR(VLOOKUP(A36,Suppliers[],2,0),\"未登録\"))","v":"KN-002884"},{"$f":"IF(A36=\"\",\"\",IFERROR(VLOOKUP($A36,Suppliers[],3,0),\"未登録\"))","v":"㈱かね善"},{"$f":"IF(A36=\"\",\"\",IFERROR(VLOOKUP($A36,Suppliers[],4,0),\"未登録\"))","v":"かね善"},{"$f":"IFERROR(VLOOKUP(A36,Suppliers[],8,0),\"\")","v":2},{"$f":"IFERROR(VLOOKUP(A36,Suppliers[],9,0),\"\")","v":0},{"$f":"IFERROR(ROUND(OriginalData[[#This Row],[仕入消費税金額]]/OriginalData[[#This Row],[仕入集計金額]],2),\"\")","v":0.08},{"$f":"IF(OriginalData[[#This Row],[消費税率]]=0.08,\"K8\",IF(OriginalData[[#This Row],[消費税率]]=0.1,\"AA\",\"\"))","v":"K8"}]
["0000000000024",8514803,681184,{"$f":"IF(A37=\"\",\"\",IFERROR(VLOOKUP(A37,Suppliers[],2,0),\"未登録\"))","v":"KN-000024"},{"$f":"IF(A37=\"\",\"\",IFERROR(VLOOKUP($A37,Suppliers[],3,0),\"未登録\"))","v":"住商ﾌｰｽﾞ株式会社"},{"$f":"IF(A37=\"\",\"\",IFERROR(VLOOKUP($A37,Suppliers[],4,0),\"未登録\"))","v":"住商ﾌｰｽﾞ"},{"$f":"IFERROR(VLOOKUP(A37,Suppliers[],8,0),\"\")","v":3},{"$f":"IFERROR(VLOOKUP(A37,Suppliers[],9,0),\"\")","v":0},{"$f":"IFERROR(ROUND(OriginalData[[#This Row],[仕入消費税金額]]/OriginalData[[#This Row],[仕入集計金額]],2),\"\")","v":0.08},{"$f":"IF(OriginalData[[#This Row],[消費税率]]=0.08,\"K8\",IF(OriginalData[[#This Row],[消費税率]]=0.1,\"AA\",\"\"))","v":"K8"}]
["0000000000062",396063,31685,{"$f":"IF(A38=\"\",\"\",IFERROR(VLOOKUP(A38,Suppliers[],2,0),\"未登録\"))","v":"KN-000062"},{"$f":"IF(A38=\"\",\"\",IFERROR(VLOOKUP($A38,Suppliers[],3,0),\"未登録\"))","v":"ユアサ・フナショク㈱"},{"$f":"IF(A38=\"\",\"\",IFERROR(VLOOKUP($A38,Suppliers[],4,0),\"未登録\"))","v":"ユアサ・フナショク"},{"$f":"IFERROR(VLOOKUP(A38,Suppliers[],8,0),\"\")","v":3},{"$f":"IFERROR(VLOOKUP(A38,Suppliers[],9,0),\"\")","v":15},{"$f":"IFERROR(ROUND(OriginalData[[#This Row],[仕入消費税金額]]/OriginalData[[#This Row],[仕入集計金額]],2),\"\")","v":0.08},{"$f":"IF(OriginalData[[#This Row],[消費税率]]=0.08,\"K8\",IF(OriginalData[[#This Row],[消費税率]]=0.1,\"AA\",\"\"))","v":"K8"}]
["0000000000222",110215,8817,{"$f":"IF(A39=\"\",\"\",IFERROR(VLOOKUP(A39,Suppliers[],2,0),\"未登録\"))","v":"KN-000222"},{"$f":"IF(A39=\"\",\"\",IFERROR(VLOOKUP($A39,Suppliers[],3,0),\"未登録\"))","v":"千葉製粉㈱"},{"$f":"IF(A39=\"\",\"\",IFERROR(VLOOKUP($A39,Suppliers[],4,0),\"未登録\"))","v":"千葉製粉"},{"$f":"IFERROR(VLOOKUP(A39,Suppliers[],8,0),\"\")","v":2},{"$f":"IFERROR(VLOOKUP(A39,Suppliers[],9,0),\"\")","v":20},{"$f":"IFERROR(ROUND(OriginalData[[#This Row],[仕入消費税金額]]/OriginalData[[#This Row],[仕入集計金額]],2),\"\")","v":0.08},{"$f":"IF(OriginalData[[#This Row],[消費税率]]=0.08,\"K8\",IF(OriginalData[[#This Row],[消費税率]]=0.1,\"AA\",\"\"))","v":"K8"}]
["0000000000280",551154,44092,{"$f":"IF(A40=\"\",\"\",IFERROR(VLOOKUP(A40,Suppliers[],2,0),\"未登録\"))","v":"KN-000280"},{"$f":"IF(A40=\"\",\"\",IFERROR(VLOOKUP($A40,Suppliers[],3,0),\"未登録\"))","v":"ﾔﾏｼﾞｮｳ商事㈱"},{"$f":"IF(A40=\"\",\"\",IFERROR(VLOOKUP($A40,Suppliers[],4,0),\"未登録\"))","v":"ﾔﾏｼﾞｮｳ商事"},{"$f":"IFERROR(VLOOKUP(A40,Suppliers[],8,0),\"\")","v":2},{"$f":"IFERROR(VLOOKUP(A40,Suppliers[],9,0),\"\")","v":0},{"$f":"IFERROR(ROUND(OriginalData[[#This Row],[仕入消費税金額]]/OriginalData[[#This Row],[仕入集計金額]],2),\"\")","v":0.08},{"$f":"IF(OriginalData[[#This Row],[消費税率]]=0.08,\"K8\",IF(OriginalData[[#This Row],[消費税率]]=0.1,\"AA\",\"\"))","v":"K8"}]
["0000000000351",526900,42180,{"$f":"IF(A41=\"\",\"\",IFERROR(VLOOKUP(A41,Suppliers[],2,0),\"未登録\"))","v":"KN-000351"},{"$f":"IF(A41=\"\",\"\",IFERROR(VLOOKUP($A41,Suppliers[],3,0),\"未登録\"))","v":"杉山商事㈱"},{"$f":"IF(A41=\"\",\"\",IFERROR(VLOOKUP($A41,Suppliers[],4,0),\"未登録\"))","v":"杉山商事"},{"$f":"IFERROR(VLOOKUP(A41,Suppliers[],8,0),\"\")","v":2},{"$f":"IFERROR(VLOOKUP(A41,Suppliers[],9,0),\"\")","v":0},{"$f":"IFERROR(ROUND(OriginalData[[#This Row],[仕入消費税金額]]/OriginalData[[#This Row],[仕入集計金額]],2),\"\")","v":0.08},{"$f":"IF(OriginalData[[#This Row],[消費税率]]=0.08,\"K8\",IF(OriginalData[[#This Row],[消費税率]]=0.1,\"AA\",\"\"))","v":"K8"}]
["0000000001010",955946,76476,{"$f":"IF(A42=\"\",\"\",IFERROR(VLOOKUP(A42,Suppliers[],2,0),\"未登録\"))","v":"KN-001010"},{"$f":"IF(A42=\"\",\"\",IFERROR(VLOOKUP($A42,Suppliers[],3,0),\"未登録\"))","v":"三井物産㈱　サンヨ－食品製品"},{"$f":"IF(A42=\"\",\"\",IFERROR(VLOOKUP($A42,Suppliers[],4,0),\"未登録\"))","v":"三井物産(サンヨ－)"},{"$f":"IFERROR(VLOOKUP(A42,Suppliers[],8,0),\"\")","v":3},{"$f":"IFERROR(VLOOKUP(A42,Suppliers[],9,0),\"\")","v":0},{"$f":"IFERROR(ROUND(OriginalData[[#This Row],[仕入消費税金額]]/OriginalData[[#This Row],[仕入集計金額]],2),\"\")","v":0.08},{"$f":"IF(OriginalData[[#This Row],[消費税率]]=0.08,\"K8\",IF(OriginalData[[#This Row],[消費税率]]=0.1,\"AA\",\"\"))","v":"K8"}]
["0000000001027",169777,13582,{"$f":"IF(A43=\"\",\"\",IFERROR(VLOOKUP(A43,Suppliers[],2,0),\"未登録\"))","v":"KN-001027"},{"$f":"IF(A43=\"\",\"\",IFERROR(VLOOKUP($A43,Suppliers[],3,0),\"未登録\"))","v":"明星食品㈱"},{"$f":"IF(A43=\"\",\"\",IFERROR(VLOOKUP($A43,Suppliers[],4,0),\"未登録\"))","v":"明星食品"},{"$f":"IFERROR(VLOOKUP(A43,Suppliers[],8,0),\"\")","v":2},{"$f":"IFERROR(VLOOKUP(A43,Suppliers[],9,0),\"\")","v":15},{"$f":"IFERROR(ROUND(OriginalData[[#This Row],[仕入消費税金額]]/OriginalData[[#This Row],[仕入集計金額]],2),\"\")","v":0.08},{"$f":"IF(OriginalData[[#This Row],[消費税率]]=0.08,\"K8\",IF(OriginalData[[#This Row],[消費税率]]=0.1,\"AA\",\"\"))","v":"K8"}]
["0000000001034",65959,5275,{"$f":"IF(A44=\"\",\"\",IFERROR(VLOOKUP(A44,Suppliers[],2,0),\"未登録\"))","v":"KN-001034"},{"$f":"IF(A44=\"\",\"\",IFERROR(VLOOKUP($A44,Suppliers[],3,0),\"未登録\"))","v":"東洋水産㈱"},{"$f":"IF(A44=\"\",\"\",IFERROR(VLOOKUP($A44,Suppliers[],4,0),\"未登録\"))","v":"東洋水産"},{"$f":"IFERROR(VLOOKUP(A44,Suppliers[],8,0),\"\")","v":3},{"$f":"IFERROR(VLOOKUP(A44,Suppliers[],9,0),\"\")","v":0},{"$f":"IFERROR(ROUND(OriginalData[[#This Row],[仕入消費税金額]]/OriginalData[[#This Row],[仕入集計金額]],2),\"\")","v":0.08},{"$f":"IF(OriginalData[[#This Row],[消費税率]]=0.08,\"K8\",IF(OriginalData[[#This Row],[消費税率]]=0.1,\"AA\",\"\"))","v":"K8"}]
["0000000001081",190000,15200,{"$f":"IF(A45=\"\",\"\",IFERROR(VLOOKUP(A45,Suppliers[],2,0),\"未登録\"))","v":"KN-001081"},{"$f":"IF(A45=\"\",\"\",IFERROR(VLOOKUP($A45,Suppliers[],3,0),\"未登録\"))","v":"赤城食品㈱"},{"$f":"IF(A45=\"\",\"\",IFERROR(VLOOKUP($A45,Suppliers[],4,0),\"未登録\"))","v":"赤城食品"},{"$f":"IFERROR(VLOOKUP(A45,Suppliers[],8,0),\"\")","v":2},{"$f":"IFERROR(VLOOKUP(A45,Suppliers[],9,0),\"\")","v":0},{"$f":"IFERROR(ROUND(OriginalData[[#This Row],[仕入消費税金額]]/OriginalData[[#This Row],[仕入集計金額]],2),\"\")","v":0.08},{"$f":"IF(OriginalData[[#This Row],[消費税率]]=0.08,\"K8\",IF(OriginalData[[#This Row],[消費税率]]=0.1,\"AA\",\"\"))","v":"K8"}]
["0000000001155",1344100,107525,{"$f":"IF(A46=\"\",\"\",IFERROR(VLOOKUP(A46,Suppliers[],2,0),\"未登録\"))","v":"KN-001155"},{"$f":"IF(A46=\"\",\"\",IFERROR(VLOOKUP($A46,Suppliers[],3,0),\"未登録\"))","v":"東海デキストリン株式会社"},{"$f":"IF(A46=\"\",\"\",IFERROR(VLOOKUP($A46,Suppliers[],4,0),\"未登録\"))","v":"東海デキストリン"},{"$f":"IFERROR(VLOOKUP(A46,Suppliers[],8,0),\"\")","v":2},{"$f":"IFERROR(VLOOKUP(A46,Suppliers[],9,0),\"\")","v":0},{"$f":"IFERROR(ROUND(OriginalData[[#This Row],[仕入消費税金額]]/OriginalData[[#This Row],[仕入集計金額]],2),\"\")","v":0.08},{"$f":"IF(OriginalData[[#This Row],[消費税率]]=0.08,\"K8\",IF(OriginalData[[#This Row],[消費税率]]=0.1,\"AA\",\"\"))","v":"K8"}]
["0000000001161",195000,15600,{"$f":"IF(A47=\"\",\"\",IFERROR(VLOOKUP(A47,Suppliers[],2,0),\"未登録\"))","v":"KN-001161"},{"$f":"IF(A47=\"\",\"\",IFERROR(VLOOKUP($A47,Suppliers[],3,0),\"未登録\"))","v":"小堺化学工業㈱"},{"$f":"IF(A47=\"\",\"\",IFERROR(VLOOKUP($A47,Suppliers[],4,0),\"未登録\"))","v":"小堺化学工業"},{"$f":"IFERROR(VLOOKUP(A47,Suppliers[],8,0),\"\")","v":3},{"$f":"IFERROR(VLOOKUP(A47,Suppliers[],9,0),\"\")","v":0},{"$f":"IFERROR(ROUND(OriginalData[[#This Row],[仕入消費税金額]]/OriginalData[[#This Row],[仕入集計金額]],2),\"\")","v":0.08},{"$f":"IF(OriginalData[[#This Row],[消費税率]]=0.08,\"K8\",IF(OriginalData[[#This Row],[消費税率]]=0.1,\"AA\",\"\"))","v":"K8"}]
["0000000001188",79125,6351,{"$f":"IF(A48=\"\",\"\",IFERROR(VLOOKUP(A48,Suppliers[],2,0),\"未登録\"))","v":"KN-001188"},{"$f":"IF(A48=\"\",\"\",IFERROR(VLOOKUP($A48,Suppliers[],3,0),\"未登録\"))","v":"㈲太洋食化学"},{"$f":"IF(A48=\"\",\"\",IFERROR(VLOOKUP($A48,Suppliers[],4,0),\"未登録\"))","v":"太洋食化学"},{"$f":"IFERROR(VLOOKUP(A48,Suppliers[],8,0),\"\")","v":3},{"$f":"IFERROR(VLOOKUP(A48,Suppliers[],9,0),\"\")","v":0},{"$f":"IFERROR(ROUND(OriginalData[[#This Row],[仕入消費税金額]]/OriginalData[[#This Row],[仕入集計金額]],2),\"\")","v":0.08},{"$f":"IF(OriginalData[[#This Row],[消費税率]]=0.08,\"K8\",IF(OriginalData[[#This Row],[消費税率]]=0.1,\"AA\",\"\"))","v":"K8"}]
["0000000001195",0,0,{"$f":"IF(A49=\"\",\"\",IFERROR(VLOOKUP(A49,Suppliers[],2,0),\"未登録\"))","v":"KN-001195"},{"$f":"IF(A49=\"\",\"\",IFERROR(VLOOKUP($A49,Suppliers[],3,0),\"未登録\"))","v":"ＡＤＥＫＡケミカルサプライ㈱"},{"$f":"IF(A49=\"\",\"\",IFERROR(VLOOKUP($A49,Suppliers[],4,0),\"未登録\"))","v":"ADEKAｹﾐｶﾙｻﾌﾟﾗｲ"},{"$f":"IFERROR(VLOOKUP(A49,Suppliers[],8,0),\"\")","v":3},{"$f":"IFERROR(VLOOKUP(A49,Suppliers[],9,0),\"\")","v":0},{"$f":"IFERROR(ROUND(OriginalData[[#This Row],[仕入消費税金額]]/OriginalData[[#This Row],[仕入集計金額]],2),\"\")","v":""},{"$f":"IF(OriginalData[[#This Row],[消費税率]]=0.08,\"K8\",IF(OriginalData[[#This Row],[消費税率]]=0.1,\"AA\",\"\"))","v":""}]
["0000000001232",130560,10444,{"$f":"IF(A50=\"\",\"\",IFERROR(VLOOKUP(A50,Suppliers[],2,0),\"未登録\"))","v":"KN-001232"},{"$f":"IF(A50=\"\",\"\",IFERROR(VLOOKUP($A50,Suppliers[],3,0),\"未登録\"))","v":"真田物産㈱"},{"$f":"IF(A50=\"\",\"\",IFERROR(VLOOKUP($A50,Suppliers[],4,0),\"未登録\"))","v":"真田物産"},{"$f":"IFERROR(VLOOKUP(A50,Suppliers[],8,0),\"\")","v":3},{"$f":"IFERROR(VLOOKUP(A50,Suppliers[],9,0),\"\")","v":0},{"$f":"IFERROR(ROUND(OriginalData[[#This Row],[仕入消費税金額]]/OriginalData[[#This Row],[仕入集計金額]],2),\"\")","v":0.08},{"$f":"IF(OriginalData[[#This Row],[消費税率]]=0.08,\"K8\",IF(OriginalData[[#This Row],[消費税率]]=0.1,\"AA\",\"\"))","v":"K8"}]
["0000000001294",253000,20240,{"$f":"IF(A51=\"\",\"\",IFERROR(VLOOKUP(A51,Suppliers[],2,0),\"未登録\"))","v":"KN-001294"},{"$f":"IF(A51=\"\",\"\",IFERROR(VLOOKUP($A51,Suppliers[],3,0),\"未登録\"))","v":"日本コロイド㈱"},{"$f":"IF(A51=\"\",\"\",IFERROR(VLOOKUP($A51,Suppliers[],4,0),\"未登録\"))","v":"日本コロイド"},{"$f":"IFERROR(VLOOKUP(A51,Suppliers[],8,0),\"\")","v":3},{"$f":"IFERROR(VLOOKUP(A51,Suppliers[],9,0),\"\")","v":0},{"$f":"IFERROR(ROUND(OriginalData[[#This Row],[仕入消費税金額]]/OriginalData[[#This Row],[仕入集計金額]],2),\"\")","v":0.08},{"$f":"IF(OriginalData[[#This Row],[消費税率]]=0.08,\"K8\",IF(OriginalData[[#This Row],[消費税率]]=0.1,\"AA\",\"\"))","v":"K8"}]
["0000000001300",89100,7128,{"$f":"IF(A52=\"\",\"\",IFERROR(VLOOKUP(A52,Suppliers[],2,0),\"未登録\"))","v":"KN-001300"},{"$f":"IF(A52=\"\",\"\",IFERROR(VLOOKUP($A52,Suppliers[],3,0),\"未登録\"))","v":"交易食品㈱"},{"$f":"IF(A52=\"\",\"\",IFERROR(VLOOKUP($A52,Suppliers[],4,0),\"未登録\"))","v":"交易食品"},{"$f":"IFERROR(VLOOKUP(A52,Suppliers[],8,0),\"\")","v":3},{"$f":"IFERROR(VLOOKUP(A52,Suppliers[],9,0),\"\")","v":0},{"$f":"IFERROR(ROUND(OriginalData[[#This Row],[仕入消費税金額]]/OriginalData[[#This Row],[仕入集計金額]],2),\"\")","v":0.08},{"$f":"IF(OriginalData[[#This Row],[消費税率]]=0.08,\"K8\",IF(OriginalData[[#This Row],[消費税率]]=0.1,\"AA\",\"\"))","v":"K8"}]
["0000000001348",13500,1096,{"$f":"IF(A53=\"\",\"\",IFERROR(VLOOKUP(A53,Suppliers[],2,0),\"未登録\"))","v":"KN-001348"},{"$f":"IF(A53=\"\",\"\",IFERROR(VLOOKUP($A53,Suppliers[],3,0),\"未登録\"))","v":"山印醸造㈱"},{"$f":"IF(A53=\"\",\"\",IFERROR(VLOOKUP($A53,Suppliers[],4,0),\"未登録\"))","v":"山印醸造"},{"$f":"IFERROR(VLOOKUP(A53,Suppliers[],8,0),\"\")","v":3},{"$f":"IFERROR(VLOOKUP(A53,Suppliers[],9,0),\"\")","v":0},{"$f":"IFERROR(ROUND(OriginalData[[#This Row],[仕入消費税金額]]/OriginalData[[#This Row],[仕入集計金額]],2),\"\")","v":0.08},{"$f":"IF(OriginalData[[#This Row],[消費税率]]=0.08,\"K8\",IF(OriginalData[[#This Row],[消費税率]]=0.1,\"AA\",\"\"))","v":"K8"}]
["0000000001393",149877,11991,{"$f":"IF(A54=\"\",\"\",IFERROR(VLOOKUP(A54,Suppliers[],2,0),\"未登録\"))","v":"KN-001393"},{"$f":"IF(A54=\"\",\"\",IFERROR(VLOOKUP($A54,Suppliers[],3,0),\"未登録\"))","v":"東洋水産㈱冷食"},{"$f":"IF(A54=\"\",\"\",IFERROR(VLOOKUP($A54,Suppliers[],4,0),\"未登録\"))","v":"東洋水産(冷食)"},{"$f":"IFERROR(VLOOKUP(A54,Suppliers[],8,0),\"\")","v":3},{"$f":"IFERROR(VLOOKUP(A54,Suppliers[],9,0),\"\")","v":0},{"$f":"IFERROR(ROUND(OriginalData[[#This Row],[仕入消費税金額]]/OriginalData[[#This Row],[仕入集計金額]],2),\"\")","v":0.08},{"$f":"IF(OriginalData[[#This Row],[消費税率]]=0.08,\"K8\",IF(OriginalData[[#This Row],[消費税率]]=0.1,\"AA\",\"\"))","v":"K8"}]
["0000000001423",68443,5476,{"$f":"IF(A55=\"\",\"\",IFERROR(VLOOKUP(A55,Suppliers[],2,0),\"未登録\"))","v":"KN-001423"},{"$f":"IF(A55=\"\",\"\",IFERROR(VLOOKUP($A55,Suppliers[],3,0),\"未登録\"))","v":"カネク株式会社"},{"$f":"IF(A55=\"\",\"\",IFERROR(VLOOKUP($A55,Suppliers[],4,0),\"未登録\"))","v":"カネク"},{"$f":"IFERROR(VLOOKUP(A55,Suppliers[],8,0),\"\")","v":3},{"$f":"IFERROR(VLOOKUP(A55,Suppliers[],9,0),\"\")","v":0},{"$f":"IFERROR(ROUND(OriginalData[[#This Row],[仕入消費税金額]]/OriginalData[[#This Row],[仕入集計金額]],2),\"\")","v":0.08},{"$f":"IF(OriginalData[[#This Row],[消費税率]]=0.08,\"K8\",IF(OriginalData[[#This Row],[消費税率]]=0.1,\"AA\",\"\"))","v":"K8"}]
["0000000001478",28600,2288,{"$f":"IF(A56=\"\",\"\",IFERROR(VLOOKUP(A56,Suppliers[],2,0),\"未登録\"))","v":"KN-001478"},{"$f":"IF(A56=\"\",\"\",IFERROR(VLOOKUP($A56,Suppliers[],3,0),\"未登録\"))","v":"森井食品㈱"},{"$f":"IF(A56=\"\",\"\",IFERROR(VLOOKUP($A56,Suppliers[],4,0),\"未登録\"))","v":"森井食品"},{"$f":"IFERROR(VLOOKUP(A56,Suppliers[],8,0),\"\")","v":3},{"$f":"IFERROR(VLOOKUP(A56,Suppliers[],9,0),\"\")","v":0},{"$f":"IFERROR(ROUND(OriginalData[[#This Row],[仕入消費税金額]]/OriginalData[[#This Row],[仕入集計金額]],2),\"\")","v":0.08},{"$f":"IF(OriginalData[[#This Row],[消費税率]]=0.08,\"K8\",IF(OriginalData[[#This Row],[消費税率]]=0.1,\"AA\",\"\"))","v":"K8"}]
["0000000001546",281949,22554,{"$f":"IF(A57=\"\",\"\",IFERROR(VLOOKUP(A57,Suppliers[],2,0),\"未登録\"))","v":"KN-001546"},{"$f":"IF(A57=\"\",\"\",IFERROR(VLOOKUP($A57,Suppliers[],3,0),\"未登録\"))","v":"フライスタ－㈱"},{"$f":"IF(A57=\"\",\"\",IFERROR(VLOOKUP($A57,Suppliers[],4,0),\"未登録\"))","v":"フライスタ－"},{"$f":"IFERROR(VLOOKUP(A57,Suppliers[],8,0),\"\")","v":2},{"$f":"IFERROR(VLOOKUP(A57,Suppliers[],9,0),\"\")","v":5},{"$f":"IFERROR(ROUND(OriginalData[[#This Row],[仕入消費税金額]]/OriginalData[[#This Row],[仕入集計金額]],2),\"\")","v":0.08},{"$f":"IF(OriginalData[[#This Row],[消費税率]]=0.08,\"K8\",IF(OriginalData[[#This Row],[消費税率]]=0.1,\"AA\",\"\"))","v":"K8"}]
["0000000001553",1963,157,{"$f":"IF(A58=\"\",\"\",IFERROR(VLOOKUP(A58,Suppliers[],2,0),\"未登録\"))","v":"KN-001553"},{"$f":"IF(A58=\"\",\"\",IFERROR(VLOOKUP($A58,Suppliers[],3,0),\"未登録\"))","v":"横浜食糧㈱"},{"$f":"IF(A58=\"\",\"\",IFERROR(VLOOKUP($A58,Suppliers[],4,0),\"未登録\"))","v":"横浜食糧"},{"$f":"IFERROR(VLOOKUP(A58,Suppliers[],8,0),\"\")","v":3},{"$f":"IFERROR(VLOOKUP(A58,Suppliers[],9,0),\"\")","v":0},{"$f":"IFERROR(ROUND(OriginalData[[#This Row],[仕入消費税金額]]/OriginalData[[#This Row],[仕入集計金額]],2),\"\")","v":0.08},{"$f":"IF(OriginalData[[#This Row],[消費税率]]=0.08,\"K8\",IF(OriginalData[[#This Row],[消費税率]]=0.1,\"AA\",\"\"))","v":"K8"}]
["0000000001652",42006,3390,{"$f":"IF(A59=\"\",\"\",IFERROR(VLOOKUP(A59,Suppliers[],2,0),\"未登録\"))","v":"KN-001652"},{"$f":"IF(A59=\"\",\"\",IFERROR(VLOOKUP($A59,Suppliers[],3,0),\"未登録\"))","v":"真富士屋食品㈱"},{"$f":"IF(A59=\"\",\"\",IFERROR(VLOOKUP($A59,Suppliers[],4,0),\"未登録\"))","v":"真富士屋食品"},{"$f":"IFERROR(VLOOKUP(A59,Suppliers[],8,0),\"\")","v":3},{"$f":"IFERROR(VLOOKUP(A59,Suppliers[],9,0),\"\")","v":0},{"$f":"IFERROR(ROUND(OriginalData[[#This Row],[仕入消費税金額]]/OriginalData[[#This Row],[仕入集計金額]],2),\"\")","v":0.08},{"$f":"IF(OriginalData[[#This Row],[消費税率]]=0.08,\"K8\",IF(OriginalData[[#This Row],[消費税率]]=0.1,\"AA\",\"\"))","v":"K8"}]
["0000000001669",20535,1643,{"$f":"IF(A60=\"\",\"\",IFERROR(VLOOKUP(A60,Suppliers[],2,0),\"未登録\"))","v":"KN-001669"},{"$f":"IF(A60=\"\",\"\",IFERROR(VLOOKUP($A60,Suppliers[],3,0),\"未登録\"))","v":"エバラ食品工業㈱"},{"$f":"IF(A60=\"\",\"\",IFERROR(VLOOKUP($A60,Suppliers[],4,0),\"未登録\"))","v":"エバラ食品工業"},{"$f":"IFERROR(VLOOKUP(A60,Suppliers[],8,0),\"\")","v":2},{"$f":"IFERROR(VLOOKUP(A60,Suppliers[],9,0),\"\")","v":25},{"$f":"IFERROR(ROUND(OriginalData[[#This Row],[仕入消費税金額]]/OriginalData[[#This Row],[仕入集計金額]],2),\"\")","v":0.08},{"$f":"IF(OriginalData[[#This Row],[消費税率]]=0.08,\"K8\",IF(OriginalData[[#This Row],[消費税率]]=0.1,\"AA\",\"\"))","v":"K8"}]
["0000000001676",167905,13432,{"$f":"IF(A61=\"\",\"\",IFERROR(VLOOKUP(A61,Suppliers[],2,0),\"未登録\"))","v":"KN-001676"},{"$f":"IF(A61=\"\",\"\",IFERROR(VLOOKUP($A61,Suppliers[],3,0),\"未登録\"))","v":"㈱榮村商店"},{"$f":"IF(A61=\"\",\"\",IFERROR(VLOOKUP($A61,Suppliers[],4,0),\"未登録\"))","v":"榮村商店"},{"$f":"IFERROR(VLOOKUP(A61,Suppliers[],8,0),\"\")","v":3},{"$f":"IFERROR(VLOOKUP(A61,Suppliers[],9,0),\"\")","v":0},{"$f":"IFERROR(ROUND(OriginalData[[#This Row],[仕入消費税金額]]/OriginalData[[#This Row],[仕入集計金額]],2),\"\")","v":0.08},{"$f":"IF(OriginalData[[#This Row],[消費税率]]=0.08,\"K8\",IF(OriginalData[[#This Row],[消費税率]]=0.1,\"AA\",\"\"))","v":"K8"}]
["0000000001690",35150,2812,{"$f":"IF(A62=\"\",\"\",IFERROR(VLOOKUP(A62,Suppliers[],2,0),\"未登録\"))","v":"KN-001690"},{"$f":"IF(A62=\"\",\"\",IFERROR(VLOOKUP($A62,Suppliers[],3,0),\"未登録\"))","v":"三井物産㈱　丸美屋フ－ズ"},{"$f":"IF(A62=\"\",\"\",IFERROR(VLOOKUP($A62,Suppliers[],4,0),\"未登録\"))","v":"三井物産(丸美屋)"},{"$f":"IFERROR(VLOOKUP(A62,Suppliers[],8,0),\"\")","v":3},{"$f":"IFERROR(VLOOKUP(A62,Suppliers[],9,0),\"\")","v":0},{"$f":"IFERROR(ROUND(OriginalData[[#This Row],[仕入消費税金額]]/OriginalData[[#This Row],[仕入集計金額]],2),\"\")","v":0.08},{"$f":"IF(OriginalData[[#This Row],[消費税率]]=0.08,\"K8\",IF(OriginalData[[#This Row],[消費税率]]=0.1,\"AA\",\"\"))","v":"K8"}]
["0000000001737",62700,5016,{"$f":"IF(A63=\"\",\"\",IFERROR(VLOOKUP(A63,Suppliers[],2,0),\"未登録\"))","v":"KN-001737"},{"$f":"IF(A63=\"\",\"\",IFERROR(VLOOKUP($A63,Suppliers[],3,0),\"未登録\"))","v":"平和食品工業㈱"},{"$f":"IF(A63=\"\",\"\",IFERROR(VLOOKUP($A63,Suppliers[],4,0),\"未登録\"))","v":"平和食品工業"},{"$f":"IFERROR(VLOOKUP(A63,Suppliers[],8,0),\"\")","v":2},{"$f":"IFERROR(VLOOKUP(A63,Suppliers[],9,0),\"\")","v":0},{"$f":"IFERROR(ROUND(OriginalData[[#This Row],[仕入消費税金額]]/OriginalData[[#This Row],[仕入集計金額]],2),\"\")","v":0.08},{"$f":"IF(OriginalData[[#This Row],[消費税率]]=0.08,\"K8\",IF(OriginalData[[#This Row],[消費税率]]=0.1,\"AA\",\"\"))","v":"K8"}]
["0000000001751",180450,14436,{"$f":"IF(A64=\"\",\"\",IFERROR(VLOOKUP(A64,Suppliers[],2,0),\"未登録\"))","v":"KN-001751"},{"$f":"IF(A64=\"\",\"\",IFERROR(VLOOKUP($A64,Suppliers[],3,0),\"未登録\"))","v":"太陽商事㈱"},{"$f":"IF(A64=\"\",\"\",IFERROR(VLOOKUP($A64,Suppliers[],4,0),\"未登録\"))","v":"太陽商事"},{"$f":"IFERROR(VLOOKUP(A64,Suppliers[],8,0),\"\")","v":3},{"$f":"IFERROR(VLOOKUP(A64,Suppliers[],9,0),\"\")","v":0},{"$f":"IFERROR(ROUND(OriginalData[[#This Row],[仕入消費税金額]]/OriginalData[[#This Row],[仕入集計金額]],2),\"\")","v":0.08},{"$f":"IF(OriginalData[[#This Row],[消費税率]]=0.08,\"K8\",IF(OriginalData[[#This Row],[消費税率]]=0.1,\"AA\",\"\"))","v":"K8"}]
["0000000001831",0,0,{"$f":"IF(A65=\"\",\"\",IFERROR(VLOOKUP(A65,Suppliers[],2,0),\"未登録\"))","v":"KN-001831"},{"$f":"IF(A65=\"\",\"\",IFERROR(VLOOKUP($A65,Suppliers[],3,0),\"未登録\"))","v":"大信実業株式会社"},{"$f":"IF(A65=\"\",\"\",IFERROR(VLOOKUP($A65,Suppliers[],4,0),\"未登録\"))","v":"大信実業"},{"$f":"IFERROR(VLOOKUP(A65,Suppliers[],8,0),\"\")","v":3},{"$f":"IFERROR(VLOOKUP(A65,Suppliers[],9,0),\"\")","v":0},{"$f":"IFERROR(ROUND(OriginalData[[#This Row],[仕入消費税金額]]/OriginalData[[#This Row],[仕入集計金額]],2),\"\")","v":""},{"$f":"IF(OriginalData[[#This Row],[消費税率]]=0.08,\"K8\",IF(OriginalData[[#This Row],[消費税率]]=0.1,\"AA\",\"\"))","v":""}]
["0000000001850",190230,15214,{"$f":"IF(A66=\"\",\"\",IFERROR(VLOOKUP(A66,Suppliers[],2,0),\"未登録\"))","v":"KN-001850"},{"$f":"IF(A66=\"\",\"\",IFERROR(VLOOKUP($A66,Suppliers[],3,0),\"未登録\"))","v":"天狗缶詰株式会社　東京営業所"},{"$f":"IF(A66=\"\",\"\",IFERROR(VLOOKUP($A66,Suppliers[],4,0),\"未登録\"))","v":"天狗缶詰"},{"$f":"IFERROR(VLOOKUP(A66,Suppliers[],8,0),\"\")","v":3},{"$f":"IFERROR(VLOOKUP(A66,Suppliers[],9,0),\"\")","v":0},{"$f":"IFERROR(ROUND(OriginalData[[#This Row],[仕入消費税金額]]/OriginalData[[#This Row],[仕入集計金額]],2),\"\")","v":0.08},{"$f":"IF(OriginalData[[#This Row],[消費税率]]=0.08,\"K8\",IF(OriginalData[[#This Row],[消費税率]]=0.1,\"AA\",\"\"))","v":"K8"}]
["0000000001898",85691,6874,{"$f":"IF(A67=\"\",\"\",IFERROR(VLOOKUP(A67,Suppliers[],2,0),\"未登録\"))","v":"KN-001898"},{"$f":"IF(A67=\"\",\"\",IFERROR(VLOOKUP($A67,Suppliers[],3,0),\"未登録\"))","v":"三栄フーズ株式会社"},{"$f":"IF(A67=\"\",\"\",IFERROR(VLOOKUP($A67,Suppliers[],4,0),\"未登録\"))","v":"三栄フーズ"},{"$f":"IFERROR(VLOOKUP(A67,Suppliers[],8,0),\"\")","v":2},{"$f":"IFERROR(VLOOKUP(A67,Suppliers[],9,0),\"\")","v":0},{"$f":"IFERROR(ROUND(OriginalData[[#This Row],[仕入消費税金額]]/OriginalData[[#This Row],[仕入集計金額]],2),\"\")","v":0.08},{"$f":"IF(OriginalData[[#This Row],[消費税率]]=0.08,\"K8\",IF(OriginalData[[#This Row],[消費税率]]=0.1,\"AA\",\"\"))","v":"K8"}]
["0000000001967",0,0,{"$f":"IF(A68=\"\",\"\",IFERROR(VLOOKUP(A68,Suppliers[],2,0),\"未登録\"))","v":"KN-001967"},{"$f":"IF(A68=\"\",\"\",IFERROR(VLOOKUP($A68,Suppliers[],3,0),\"未登録\"))","v":"㈱神明"},{"$f":"IF(A68=\"\",\"\",IFERROR(VLOOKUP($A68,Suppliers[],4,0),\"未登録\"))","v":"神明"},{"$f":"IFERROR(VLOOKUP(A68,Suppliers[],8,0),\"\")","v":3},{"$f":"IFERROR(VLOOKUP(A68,Suppliers[],9,0),\"\")","v":0},{"$f":"IFERROR(ROUND(OriginalData[[#This Row],[仕入消費税金額]]/OriginalData[[#This Row],[仕入集計金額]],2),\"\")","v":""},{"$f":"IF(OriginalData[[#This Row],[消費税率]]=0.08,\"K8\",IF(OriginalData[[#This Row],[消費税率]]=0.1,\"AA\",\"\"))","v":""}]
["0000000002020",75000,6000,{"$f":"IF(A69=\"\",\"\",IFERROR(VLOOKUP(A69,Suppliers[],2,0),\"未登録\"))","v":"KN-002020"},{"$f":"IF(A69=\"\",\"\",IFERROR(VLOOKUP($A69,Suppliers[],3,0),\"未登録\"))","v":"三井物産㈱"},{"$f":"IF(A69=\"\",\"\",IFERROR(VLOOKUP($A69,Suppliers[],4,0),\"未登録\"))","v":"三井物産"},{"$f":"IFERROR(VLOOKUP(A69,Suppliers[],8,0),\"\")","v":3},{"$f":"IFERROR(VLOOKUP(A69,Suppliers[],9,0),\"\")","v":0},{"$f":"IFERROR(ROUND(OriginalData[[#This Row],[仕入消費税金額]]/OriginalData[[#This Row],[仕入集計金額]],2),\"\")","v":0.08},{"$f":"IF(OriginalData[[#This Row],[消費税率]]=0.08,\"K8\",IF(OriginalData[[#This Row],[消費税率]]=0.1,\"AA\",\"\"))","v":"K8"}]
["0000000002303",427234,34178,{"$f":"IF(A70=\"\",\"\",IFERROR(VLOOKUP(A70,Suppliers[],2,0),\"未登録\"))","v":"KN-002303"},{"$f":"IF(A70=\"\",\"\",IFERROR(VLOOKUP($A70,Suppliers[],3,0),\"未登録\"))","v":"金田屋㈱"},{"$f":"IF(A70=\"\",\"\",IFERROR(VLOOKUP($A70,Suppliers[],4,0),\"未登録\"))","v":"金田屋"},{"$f":"IFERROR(VLOOKUP(A70,Suppliers[],8,0),\"\")","v":2},{"$f":"IFERROR(VLOOKUP(A70,Suppliers[],9,0),\"\")","v":0},{"$f":"IFERROR(ROUND(OriginalData[[#This Row],[仕入消費税金額]]/OriginalData[[#This Row],[仕入集計金額]],2),\"\")","v":0.08},{"$f":"IF(OriginalData[[#This Row],[消費税率]]=0.08,\"K8\",IF(OriginalData[[#This Row],[消費税率]]=0.1,\"AA\",\"\"))","v":"K8"}]
["0000000002655",27000,2160,{"$f":"IF(A71=\"\",\"\",IFERROR(VLOOKUP(A71,Suppliers[],2,0),\"未登録\"))","v":"KN-002655"},{"$f":"IF(A71=\"\",\"\",IFERROR(VLOOKUP($A71,Suppliers[],3,0),\"未登録\"))","v":"丸松物産㈱"},{"$f":"IF(A71=\"\",\"\",IFERROR(VLOOKUP($A71,Suppliers[],4,0),\"未登録\"))","v":"丸松物産"},{"$f":"IFERROR(VLOOKUP(A71,Suppliers[],8,0),\"\")","v":3},{"$f":"IFERROR(VLOOKUP(A71,Suppliers[],9,0),\"\")","v":0},{"$f":"IFERROR(ROUND(OriginalData[[#This Row],[仕入消費税金額]]/OriginalData[[#This Row],[仕入集計金額]],2),\"\")","v":0.08},{"$f":"IF(OriginalData[[#This Row],[消費税率]]=0.08,\"K8\",IF(OriginalData[[#This Row],[消費税率]]=0.1,\"AA\",\"\"))","v":"K8"}]
["0000000002661",65000,5200,{"$f":"IF(A72=\"\",\"\",IFERROR(VLOOKUP(A72,Suppliers[],2,0),\"未登録\"))","v":"KN-002661"},{"$f":"IF(A72=\"\",\"\",IFERROR(VLOOKUP($A72,Suppliers[],3,0),\"未登録\"))","v":"京浜貿易㈱"},{"$f":"IF(A72=\"\",\"\",IFERROR(VLOOKUP($A72,Suppliers[],4,0),\"未登録\"))","v":"京浜貿易"},{"$f":"IFERROR(VLOOKUP(A72,Suppliers[],8,0),\"\")","v":3},{"$f":"IFERROR(VLOOKUP(A72,Suppliers[],9,0),\"\")","v":0},{"$f":"IFERROR(ROUND(OriginalData[[#This Row],[仕入消費税金額]]/OriginalData[[#This Row],[仕入集計金額]],2),\"\")","v":0.08},{"$f":"IF(OriginalData[[#This Row],[消費税率]]=0.08,\"K8\",IF(OriginalData[[#This Row],[消費税率]]=0.1,\"AA\",\"\"))","v":"K8"}]
["0000000002901",4800,480,{"$f":"IF(A73=\"\",\"\",IFERROR(VLOOKUP(A73,Suppliers[],2,0),\"未登録\"))","v":"KN-002901"},{"$f":"IF(A73=\"\",\"\",IFERROR(VLOOKUP($A73,Suppliers[],3,0),\"未登録\"))","v":"佐川急便株式会社"},{"$f":"IF(A73=\"\",\"\",IFERROR(VLOOKUP($A73,Suppliers[],4,0),\"未登録\"))","v":"佐川急便"},{"$f":"IFERROR(VLOOKUP(A73,Suppliers[],8,0),\"\")","v":1},{"$f":"IFERROR(VLOOKUP(A73,Suppliers[],9,0),\"\")","v":26},{"$f":"IFERROR(ROUND(OriginalData[[#This Row],[仕入消費税金額]]/OriginalData[[#This Row],[仕入集計金額]],2),\"\")","v":0.1},{"$f":"IF(OriginalData[[#This Row],[消費税率]]=0.08,\"K8\",IF(OriginalData[[#This Row],[消費税率]]=0.1,\"AA\",\"\"))","v":"AA"}]
[null,null,null,{"$f":"IF(A74=\"\",\"\",IFERROR(VLOOKUP(A74,Suppliers[],2,0),\"未登録\"))","v":""},{"$f":"IF(A74=\"\",\"\",IFERROR(VLOOKUP($A74,Suppliers[],3,0),\"未登録\"))","v":""},{"$f":"IF(A74=\"\",\"\",IFERROR(VLOOKUP($A74,Suppliers[],4,0),\"未登録\"))","v":""},{"$f":"IFERROR(VLOOKUP(A74,Suppliers[],8,0),\"\")","v":""},{"$f":"IFERROR(VLOOKUP(A74,Suppliers[],9,0),\"\")","v":""},{"$f":"IFERROR(ROUND(OriginalData[[#This Row],[仕入消費税金額]]/OriginalData[[#This Row],[仕入集計金額]],2),\"\")","v":""},{"$f":"IF(OriginalData[[#This Row],[消費税率]]=0.08,\"K8\",IF(OriginalData[[#This Row],[消費税率]]=0.1,\"AA\",\"\"))","v":""}]
[null,null,null,{"$f":"IF(A75=\"\",\"\",IFERROR(VLOOKUP(A75,Suppliers[],2,0),\"未登録\"))","v":""},{"$f":"IF(A75=\"\",\"\",IFERROR(VLOOKUP($A75,Suppliers[],3,0),\"未登録\"))","v":""},{"$f":"IF(A75=\"\",\"\",IFERROR(VLOOKUP($A75,Suppliers[],4,0),\"未登録\"))","v":""},{"$f":"IFERROR(VLOOKUP(A75,Suppliers[],8,0),\"\")","v":""},{"$f":"IFERROR(VLOOKUP(A75,Suppliers[],9,0),\"\")","v":""},{"$f":"IFERROR(ROUND(OriginalData[[#This Row],[仕入消費税金額]]/OriginalData[[#This Row],[仕入集計金額]],2),\"\")","v":""},{"$f":"IF(OriginalData[[#This Row],[消費税率]]=0.08,\"K8\",IF(OriginalData[[#This Row],[消費税率]]=0.1,\"AA\",\"\"))","v":""}]
[null,null,null,{"$f":"IF(A76=\"\",\"\",IFERROR(VLOOKUP(A76,Suppliers[],2,0),\"未登録\"))","v":""},{"$f":"IF(A76=\"\",\"\",IFERROR(VLOOKUP($A76,Suppliers[],3,0),\"未登録\"))","v":""},{"$f":"IF(A76=\"\",\"\",IFERROR(VLOOKUP($A76,Suppliers[],4,0),\"未登録\"))","v":""},{"$f":"IFERROR(VLOOKUP(A76,Suppliers[],8,0),\"\")","v":""},{"$f":"IFERROR(VLOOKUP(A76,Suppliers[],9,0),\"\")","v":""},{"$f":"IFERROR(ROUND(OriginalData[[#This Row],[仕入消費税金額]]/OriginalData[[#This Row],[仕入集計金額]],2),\"\")","v":""},{"$f":"IF(OriginalData[[#This Row],[消費税率]]=0.08,\"K8\",IF(OriginalData[[#This Row],[消費税率]]=0.1,\"AA\",\"\"))","v":""}]
[null,null,null,{"$f":"IF(A77=\"\",\"\",IFERROR(VLOOKUP(A77,Suppliers[],2,0),\"未登録\"))","v":""},{"$f":"IF(A77=\"\",\"\",IFERROR(VLOOKUP($A77,Suppliers[],3,0),\"未登録\"))","v":""},{"$f":"IF(A77=\"\",\"\",IFERROR(VLOOKUP($A77,Suppliers[],4,0),\"未登録\"))","v":""},{"$f":"IFERROR(VLOOKUP(A77,Suppliers[],8,0),\"\")","v":""},{"$f":"IFERROR(VLOOKUP(A77,Suppliers[],9,0),\"\")","v":""},{"$f":"IFERROR(ROUND(OriginalData[[#This Row],[仕入消費税金額]]/OriginalData[[#This Row],[仕入集計金額]],2),\"\")","v":""},{"$f":"IF(OriginalData[[#This Row],[消費税率]]=0.08,\"K8\",IF(OriginalData[[#This Row],[消費税率]]=0.1,\"AA\",\"\"))","v":""}]
[null,null,null,{"$f":"IF(A78=\"\",\"\",IFERROR(VLOOKUP(A78,Suppliers[],2,0),\"未登録\"))","v":""},{"$f":"IF(A78=\"\",\"\",IFERROR(VLOOKUP($A78,Suppliers[],3,0),\"未登録\"))","v":""},{"$f":"IF(A78=\"\",\"\",IFERROR(VLOOKUP($A78,Suppliers[],4,0),\"未登録\"))","v":""},{"$f":"IFERROR(VLOOKUP(A78,Suppliers[],8,0),\"\")","v":""},{"$f":"IFERROR(VLOOKUP(A78,Suppliers[],9,0),\"\")","v":""},{"$f":"IFERROR(ROUND(OriginalData[[#This Row],[仕入消費税金額]]/OriginalData[[#This Row],[仕入集計金額]],2),\"\")","v":""},{"$f":"IF(OriginalData[[#This Row],[消費税率]]=0.08,\"K8\",IF(OriginalData[[#This Row],[消費税率]]=0.1,\"AA\",\"\"))","v":""}]
[null,null,null,{"$f":"IF(A79=\"\",\"\",IFERROR(VLOOKUP(A79,Suppliers[],2,0),\"未登録\"))","v":""},{"$f":"IF(A79=\"\",\"\",IFERROR(VLOOKUP($A79,Suppliers[],3,0),\"未登録\"))","v":""},{"$f":"IF(A79=\"\",\"\",IFERROR(VLOOKUP($A79,Suppliers[],4,0),\"未登録\"))","v":""},{"$f":"IFERROR(VLOOKUP(A79,Suppliers[],8,0),\"\")","v":""},{"$f":"IFERROR(VLOOKUP(A79,Suppliers[],9,0),\"\")","v":""},{"$f":"IFERROR(ROUND(OriginalData[[#This Row],[仕入消費税金額]]/OriginalData[[#This Row],[仕入集計金額]],2),\"\")","v":""},{"$f":"IF(OriginalData[[#This Row],[消費税率]]=0.08,\"K8\",IF(OriginalData[[#This Row],[消費税率]]=0.1,\"AA\",\"\"))","v":""}]
[null,null,null,{"$f":"IF(A80=\"\",\"\",IFERROR(VLOOKUP(A80,Suppliers[],2,0),\"未登録\"))","v":""},{"$f":"IF(A80=\"\",\"\",IFERROR(VLOOKUP($A80,Suppliers[],3,0),\"未登録\"))","v":""},{"$f":"IF(A80=\"\",\"\",IFERROR(VLOOKUP($A80,Suppliers[],4,0),\"未登録\"))","v":""},{"$f":"IFERROR(VLOOKUP(A80,Suppliers[],8,0),\"\")","v":""},{"$f":"IFERROR(VLOOKUP(A80,Suppliers[],9,0),\"\")","v":""},{"$f":"IFERROR(ROUND(OriginalData[[#This Row],[仕入消費税金額]]/OriginalData[[#This Row],[仕入集計金額]],2),\"\")","v":""},{"$f":"IF(OriginalData[[#This Row],[消費税率]]=0.08,\"K8\",IF(OriginalData[[#This Row],[消費税率]]=0.1,\"AA\",\"\"))","v":""}]
[null,null,null,{"$f":"IF(A81=\"\",\"\",IFERROR(VLOOKUP(A81,Suppliers[],2,0),\"未登録\"))","v":""},{"$f":"IF(A81=\"\",\"\",IFERROR(VLOOKUP($A81,Suppliers[],3,0),\"未登録\"))","v":""},{"$f":"IF(A81=\"\",\"\",IFERROR(VLOOKUP($A81,Suppliers[],4,0),\"未登録\"))","v":""},{"$f":"IFERROR(VLOOKUP(A81,Suppliers[],8,0),\"\")","v":""},{"$f":"IFERROR(VLOOKUP(A81,Suppliers[],9,0),\"\")","v":""},{"$f":"IFERROR(ROUND(OriginalData[[#This Row],[仕入消費税金額]]/OriginalData[[#This Row],[仕入集計金額]],2),\"\")","v":""},{"$f":"IF(OriginalData[[#This Row],[消費税率]]=0.08,\"K8\",IF(OriginalData[[#This Row],[消費税率]]=0.1,\"AA\",\"\"))","v":""}]
[null,null,null,{"$f":"IF(A82=\"\",\"\",IFERROR(VLOOKUP(A82,Suppliers[],2,0),\"未登録\"))","v":""},{"$f":"IF(A82=\"\",\"\",IFERROR(VLOOKUP($A82,Suppliers[],3,0),\"未登録\"))","v":""},{"$f":"IF(A82=\"\",\"\",IFERROR(VLOOKUP($A82,Suppliers[],4,0),\"未登録\"))","v":""},{"$f":"IFERROR(VLOOKUP(A82,Suppliers[],8,0),\"\")","v":""},{"$f":"IFERROR(VLOOKUP(A82,Suppliers[],9,0),\"\")","v":""},{"$f":"IFERROR(ROUND(OriginalData[[#This Row],[仕入消費税金額]]/OriginalData[[#This Row],[仕入集計金額]],2),\"\")","v":""},{"$f":"IF(OriginalData[[#This Row],[消費税率]]=0.08,\"K8\",IF(OriginalData[[#This Row],[消費税率]]=0.1,\"AA\",\"\"))","v":""}]
[null,null,null,{"$f":"IF(A83=\"\",\"\",IFERROR(VLOOKUP(A83,Suppliers[],2,0),\"未登録\"))","v":""},{"$f":"IF(A83=\"\",\"\",IFERROR(VLOOKUP($A83,Suppliers[],3,0),\"未登録\"))","v":""},{"$f":"IF(A83=\"\",\"\",IFERROR(VLOOKUP($A83,Suppliers[],4,0),\"未登録\"))","v":""},{"$f":"IFERROR(VLOOKUP(A83,Suppliers[],8,0),\"\")","v":""},{"$f":"IFERROR(VLOOKUP(A83,Suppliers[],9,0),\"\")","v":""},{"$f":"IFERROR(ROUND(OriginalData[[#This Row],[仕入消費税金額]]/OriginalData[[#This Row],[仕入集計金額]],2),\"\")","v":""},{"$f":"IF(OriginalData[[#This Row],[消費税率]]=0.08,\"K8\",IF(OriginalData[[#This Row],[消費税率]]=0.1,\"AA\",\"\"))","v":""}]
[null,null,null,{"$f":"IF(A84=\"\",\"\",IFERROR(VLOOKUP(A84,Suppliers[],2,0),\"未登録\"))","v":""},{"$f":"IF(A84=\"\",\"\",IFERROR(VLOOKUP($A84,Suppliers[],3,0),\"未登録\"))","v":""},{"$f":"IF(A84=\"\",\"\",IFERROR(VLOOKUP($A84,Suppliers[],4,0),\"未登録\"))","v":""},{"$f":"IFERROR(VLOOKUP(A84,Suppliers[],8,0),\"\")","v":""},{"$f":"IFERROR(VLOOKUP(A84,Suppliers[],9,0),\"\")","v":""},{"$f":"IFERROR(ROUND(OriginalData[[#This Row],[仕入消費税金額]]/OriginalData[[#This Row],[仕入集計金額]],2),\"\")","v":""},{"$f":"IF(OriginalData[[#This Row],[消費税率]]=0.08,\"K8\",IF(OriginalData[[#This Row],[消費税率]]=0.1,\"AA\",\"\"))","v":""}]
[null,null,null,{"$f":"IF(A85=\"\",\"\",IFERROR(VLOOKUP(A85,Suppliers[],2,0),\"未登録\"))","v":""},{"$f":"IF(A85=\"\",\"\",IFERROR(VLOOKUP($A85,Suppliers[],3,0),\"未登録\"))","v":""},{"$f":"IF(A85=\"\",\"\",IFERROR(VLOOKUP($A85,Suppliers[],4,0),\"未登録\"))","v":""},{"$f":"IFERROR(VLOOKUP(A85,Suppliers[],8,0),\"\")","v":""},{"$f":"IFERROR(VLOOKUP(A85,Suppliers[],9,0),\"\")","v":""},{"$f":"IFERROR(ROUND(OriginalData[[#This Row],[仕入消費税金額]]/OriginalData[[#This Row],[仕入集計金額]],2),\"\")","v":""},{"$f":"IF(OriginalData[[#This Row],[消費税率]]=0.08,\"K8\",IF(OriginalData[[#This Row],[消費税率]]=0.1,\"AA\",\"\"))","v":""}]
[null,null,null,{"$f":"IF(A86=\"\",\"\",IFERROR(VLOOKUP(A86,Suppliers[],2,0),\"未登録\"))","v":""},{"$f":"IF(A86=\"\",\"\",IFERROR(VLOOKUP($A86,Suppliers[],3,0),\"未登録\"))","v":""},{"$f":"IF(A86=\"\",\"\",IFERROR(VLOOKUP($A86,Suppliers[],4,0),\"未登録\"))","v":""},{"$f":"IFERROR(VLOOKUP(A86,Suppliers[],8,0),\"\")","v":""},{"$f":"IFERROR(VLOOKUP(A86,Suppliers[],9,0),\"\")","v":""},{"$f":"IFERROR(ROUND(OriginalData[[#This Row],[仕入消費税金額]]/OriginalData[[#This Row],[仕入集計金額]],2),\"\")","v":""},{"$f":"IF(OriginalData[[#This Row],[消費税率]]=0.08,\"K8\",IF(OriginalData[[#This Row],[消費税率]]=0.1,\"AA\",\"\"))","v":""}]
[null,null,null,{"$f":"IF(A87=\"\",\"\",IFERROR(VLOOKUP(A87,Suppliers[],2,0),\"未登録\"))","v":""},{"$f":"IF(A87=\"\",\"\",IFERROR(VLOOKUP($A87,Suppliers[],3,0),\"未登録\"))","v":""},{"$f":"IF(A87=\"\",\"\",IFERROR(VLOOKUP($A87,Suppliers[],4,0),\"未登録\"))","v":""},{"$f":"IFERROR(VLOOKUP(A87,Suppliers[],8,0),\"\")","v":""},{"$f":"IFERROR(VLOOKUP(A87,Suppliers[],9,0),\"\")","v":""},{"$f":"IFERROR(ROUND(OriginalData[[#This Row],[仕入消費税金額]]/OriginalData[[#This Row],[仕入集計金額]],2),\"\")","v":""},{"$f":"IF(OriginalData[[#This Row],[消費税率]]=0.08,\"K8\",IF(OriginalData[[#This Row],[消費税率]]=0.1,\"AA\",\"\"))","v":""}]
[null,null,null,{"$f":"IF(A88=\"\",\"\",IFERROR(VLOOKUP(A88,Suppliers[],2,0),\"未登録\"))","v":""},{"$f":"IF(A88=\"\",\"\",IFERROR(VLOOKUP($A88,Suppliers[],3,0),\"未登録\"))","v":""},{"$f":"IF(A88=\"\",\"\",IFERROR(VLOOKUP($A88,Suppliers[],4,0),\"未登録\"))","v":""},{"$f":"IFERROR(VLOOKUP(A88,Suppliers[],8,0),\"\")","v":""},{"$f":"IFERROR(VLOOKUP(A88,Suppliers[],9,0),\"\")","v":""},{"$f":"IFERROR(ROUND(OriginalData[[#This Row],[仕入消費税金額]]/OriginalData[[#This Row],[仕入集計金額]],2),\"\")","v":""},{"$f":"IF(OriginalData[[#This Row],[消費税率]]=0.08,\"K8\",IF(OriginalData[[#This Row],[消費税率]]=0.1,\"AA\",\"\"))","v":""}]
[null,null,null,{"$f":"IF(A89=\"\",\"\",IFERROR(VLOOKUP(A89,Suppliers[],2,0),\"未登録\"))","v":""},{"$f":"IF(A89=\"\",\"\",IFERROR(VLOOKUP($A89,Suppliers[],3,0),\"未登録\"))","v":""},{"$f":"IF(A89=\"\",\"\",IFERROR(VLOOKUP($A89,Suppliers[],4,0),\"未登録\"))","v":""},{"$f":"IFERROR(VLOOKUP(A89,Suppliers[],8,0),\"\")","v":""},{"$f":"IFERROR(VLOOKUP(A89,Suppliers[],9,0),\"\")","v":""},{"$f":"IFERROR(ROUND(OriginalData[[#This Row],[仕入消費税金額]]/OriginalData[[#This Row],[仕入集計金額]],2),\"\")","v":""},{"$f":"IF(OriginalData[[#This Row],[消費税率]]=0.08,\"K8\",IF(OriginalData[[#This Row],[消費税率]]=0.1,\"AA\",\"\"))","v":""}]
[null,null,null,{"$f":"IF(A90=\"\",\"\",IFERROR(VLOOKUP(A90,Suppliers[],2,0),\"未登録\"))","v":""},{"$f":"IF(A90=\"\",\"\",IFERROR(VLOOKUP($A90,Suppliers[],3,0),\"未登録\"))","v":""},{"$f":"IF(A90=\"\",\"\",IFERROR(VLOOKUP($A90,Suppliers[],4,0),\"未登録\"))","v":""},{"$f":"IFERROR(VLOOKUP(A90,Suppliers[],8,0),\"\")","v":""},{"$f":"IFERROR(VLOOKUP(A90,Suppliers[],9,0),\"\")","v":""},{"$f":"IFERROR(ROUND(OriginalData[[#This Row],[仕入消費税金額]]/OriginalData[[#This Row],[仕入集計金額]],2),\"\")","v":""},{"$f":"IF(OriginalData[[#This Row],[消費税率]]=0.08,\"K8\",IF(OriginalData[[#This Row],[消費税率]]=0.1,\"AA\",\"\"))","v":""}]
[null,null,null,{"$f":"IF(A91=\"\",\"\",IFERROR(VLOOKUP(A91,Suppliers[],2,0),\"未登録\"))","v":""},{"$f":"IF(A91=\"\",\"\",IFERROR(VLOOKUP($A91,Suppliers[],3,0),\"未登録\"))","v":""},{"$f":"IF(A91=\"\",\"\",IFERROR(VLOOKUP($A91,Suppliers[],4,0),\"未登録\"))","v":""},{"$f":"IFERROR(VLOOKUP(A91,Suppliers[],8,0),\"\")","v":""},{"$f":"IFERROR(VLOOKUP(A91,Suppliers[],9,0),\"\")","v":""},{"$f":"IFERROR(ROUND(OriginalData[[#This Row],[仕入消費税金額]]/OriginalData[[#This Row],[仕入集計金額]],2),\"\")","v":""},{"$f":"IF(OriginalData[[#This Row],[消費税率]]=0.08,\"K8\",IF(OriginalData[[#This Row],[消費税率]]=0.1,\"AA\",\"\"))","v":""}]
[null,null,null,{"$f":"IF(A92=\"\",\"\",IFERROR(VLOOKUP(A92,Suppliers[],2,0),\"未登録\"))","v":""},{"$f":"IF(A92=\"\",\"\",IFERROR(VLOOKUP($A92,Suppliers[],3,0),\"未登録\"))","v":""},{"$f":"IF(A92=\"\",\"\",IFERROR(VLOOKUP($A92,Suppliers[],4,0),\"未登録\"))","v":""},{"$f":"IFERROR(VLOOKUP(A92,Suppliers[],8,0),\"\")","v":""},{"$f":"IFERROR(VLOOKUP(A92,Suppliers[],9,0),\"\")","v":""},{"$f":"IFERROR(ROUND(OriginalData[[#This Row],[仕入消費税金額]]/OriginalData[[#This Row],[仕入集計金額]],2),\"\")","v":""},{"$f":"IF(OriginalData[[#This Row],[消費税率]]=0.08,\"K8\",IF(OriginalData[[#This Row],[消費税率]]=0.1,\"AA\",\"\"))","v":""}]
[null,null,null,{"$f":"IF(A93=\"\",\"\",IFERROR(VLOOKUP(A93,Suppliers[],2,0),\"未登録\"))","v":""},{"$f":"IF(A93=\"\",\"\",IFERROR(VLOOKUP($A93,Suppliers[],3,0),\"未登録\"))","v":""},{"$f":"IF(A93=\"\",\"\",IFERROR(VLOOKUP($A93,Suppliers[],4,0),\"未登録\"))","v":""},{"$f":"IFERROR(VLOOKUP(A93,Suppliers[],8,0),\"\")","v":""},{"$f":"IFERROR(VLOOKUP(A93,Suppliers[],9,0),\"\")","v":""},{"$f":"IFERROR(ROUND(OriginalData[[#This Row],[仕入消費税金額]]/OriginalData[[#This Row],[仕入集計金額]],2),\"\")","v":""},{"$f":"IF(OriginalData[[#This Row],[消費税率]]=0.08,\"K8\",IF(OriginalData[[#This Row],[消費税率]]=0.1,\"AA\",\"\"))","v":""}]
[null,null,null,{"$f":"IF(A94=\"\",\"\",IFERROR(VLOOKUP(A94,Suppliers[],2,0),\"未登録\"))","v":""},{"$f":"IF(A94=\"\",\"\",IFERROR(VLOOKUP($A94,Suppliers[],3,0),\"未登録\"))","v":""},{"$f":"IF(A94=\"\",\"\",IFERROR(VLOOKUP($A94,Suppliers[],4,0),\"未登録\"))","v":""},{"$f":"IFERROR(VLOOKUP(A94,Suppliers[],8,0),\"\")","v":""},{"$f":"IFERROR(VLOOKUP(A94,Suppliers[],9,0),\"\")","v":""},{"$f":"IFERROR(ROUND(OriginalData[[#This Row],[仕入消費税金額]]/OriginalData[[#This Row],[仕入集計金額]],2),\"\")","v":""},{"$f":"IF(OriginalData[[#This Row],[消費税率]]=0.08,\"K8\",IF(OriginalData[[#This Row],[消費税率]]=0.1,\"AA\",\"\"))","v":""}]
[null,null,null,{"$f":"IF(A95=\"\",\"\",IFERROR(VLOOKUP(A95,Suppliers[],2,0),\"未登録\"))","v":""},{"$f":"IF(A95=\"\",\"\",IFERROR(VLOOKUP($A95,Suppliers[],3,0),\"未登録\"))","v":""},{"$f":"IF(A95=\"\",\"\",IFERROR(VLOOKUP($A95,Suppliers[],4,0),\"未登録\"))","v":""},{"$f":"IFERROR(VLOOKUP(A95,Suppliers[],8,0),\"\")","v":""},{"$f":"IFERROR(VLOOKUP(A95,Suppliers[],9,0),\"\")","v":""},{"$f":"IFERROR(ROUND(OriginalData[[#This Row],[仕入消費税金額]]/OriginalData[[#This Row],[仕入集計金額]],2),\"\")","v":""},{"$f":"IF(OriginalData[[#This Row],[消費税率]]=0.08,\"K8\",IF(OriginalData[[#This Row],[消費税率]]=0.1,\"AA\",\"\"))","v":""}]
[null,null,null,{"$f":"IF(A96=\"\",\"\",IFERROR(VLOOKUP(A96,Suppliers[],2,0),\"未登録\"))","v":""},{"$f":"IF(A96=\"\",\"\",IFERROR(VLOOKUP($A96,Suppliers[],3,0),\"未登録\"))","v":""},{"$f":"IF(A96=\"\",\"\",IFERROR(VLOOKUP($A96,Suppliers[],4,0),\"未登録\"))","v":""},{"$f":"IFERROR(VLOOKUP(A96,Suppliers[],8,0),\"\")","v":""},{"$f":"IFERROR(VLOOKUP(A96,Suppliers[],9,0),\"\")","v":""},{"$f":"IFERROR(ROUND(OriginalData[[#This Row],[仕入消費税金額]]/OriginalData[[#This Row],[仕入集計金額]],2),\"\")","v":""},{"$f":"IF(OriginalData[[#This Row],[消費税率]]=0.08,\"K8\",IF(OriginalData[[#This Row],[消費税率]]=0.1,\"AA\",\"\"))","v":""}]
[null,null,null,{"$f":"IF(A97=\"\",\"\",IFERROR(VLOOKUP(A97,Suppliers[],2,0),\"未登録\"))","v":""},{"$f":"IF(A97=\"\",\"\",IFERROR(VLOOKUP($A97,Suppliers[],3,0),\"未登録\"))","v":""},{"$f":"IF(A97=\"\",\"\",IFERROR(VLOOKUP($A97,Suppliers[],4,0),\"未登録\"))","v":""},{"$f":"IFERROR(VLOOKUP(A97,Suppliers[],8,0),\"\")","v":""},{"$f":"IFERROR(VLOOKUP(A97,Suppliers[],9,0),\"\")","v":""},{"$f":"IFERROR(ROUND(OriginalData[[#This Row],[仕入消費税金額]]/OriginalData[[#This Row],[仕入集計金額]],2),\"\")","v":""},{"$f":"IF(OriginalData[[#This Row],[消費税率]]=0.08,\"K8\",IF(OriginalData[[#This Row],[消費税率]]=0.1,\"AA\",\"\"))","v":""}]
[null,null,null,{"$f":"IF(A98=\"\",\"\",IFERROR(VLOOKUP(A98,Suppliers[],2,0),\"未登録\"))","v":""},{"$f":"IF(A98=\"\",\"\",IFERROR(VLOOKUP($A98,Suppliers[],3,0),\"未登録\"))","v":""},{"$f":"IF(A98=\"\",\"\",IFERROR(VLOOKUP($A98,Suppliers[],4,0),\"未登録\"))","v":""},{"$f":"IFERROR(VLOOKUP(A98,Suppliers[],8,0),\"\")","v":""},{"$f":"IFERROR(VLOOKUP(A98,Suppliers[],9,0),\"\")","v":""},{"$f":"IFERROR(ROUND(OriginalData[[#This Row],[仕入消費税金額]]/OriginalData[[#This Row],[仕入集計金額]],2),\"\")","v":""},{"$f":"IF(OriginalData[[#This Row],[消費税率]]=0.08,\"K8\",IF(OriginalData[[#This Row],[消費税率]]=0.1,\"AA\",\"\"))","v":""}]
[null,null,null,{"$f":"IF(A99=\"\",\"\",IFERROR(VLOOKUP(A99,Suppliers[],2,0),\"未登録\"))","v":""},{"$f":"IF(A99=\"\",\"\",IFERROR(VLOOKUP($A99,Suppliers[],3,0),\"未登録\"))","v":""},{"$f":"IF(A99=\"\",\"\",IFERROR(VLOOKUP($A99,Suppliers[],4,0),\"未登録\"))","v":""},{"$f":"IFERROR(VLOOKUP(A99,Suppliers[],8,0),\"\")","v":""},{"$f":"IFERROR(VLOOKUP(A99,Suppliers[],9,0),\"\")","v":""},{"$f":"IFERROR(ROUND(OriginalData[[#This Row],[仕入消費税金額]]/OriginalData[[#This Row],[仕入集計金額]],2),\"\")","v":""},{"$f":"IF(OriginalData[[#This Row],[消費税率]]=0.08,\"K8\",IF(OriginalData[[#This Row],[消費税率]]=0.1,\"AA\",\"\"))","v":""}]
[null,null,null,{"$f":"IF(A100=\"\",\"\",IFERROR(VLOOKUP(A100,Suppliers[],2,0),\"未登録\"))","v":""},{"$f":"IF(A100=\"\",\"\",IFERROR(VLOOKUP($A100,Suppliers[],3,0),\"未登録\"))","v":""},{"$f":"IF(A100=\"\",\"\",IFERROR(VLOOKUP($A100,Suppliers[],4,0),\"未登録\"))","v":""},{"$f":"IFERROR(VLOOKUP(A100,Suppliers[],8,0),\"\")","v":""},{"$f":"IFERROR(VLOOKUP(A100,Suppliers[],9,0),\"\")","v":""},{"$f":"IFERROR(ROUND(OriginalData[[#This Row],[仕入消費税金額]]/OriginalData[[#This Row],[仕入集計金額]],2),\"\")","v":""},{"$f":"IF(OriginalData[[#This Row],[消費税率]]=0.08,\"K8\",IF(OriginalData[[#This Row],[消費税率]]=0.1,\"AA\",\"\"))","v":""}]
[null,null,null,{"$f":"IF(A101=\"\",\"\",IFERROR(VLOOKUP(A101,Suppliers[],2,0),\"未登録\"))","v":""},{"$f":"IF(A101=\"\",\"\",IFERROR(VLOOKUP($A101,Suppliers[],3,0),\"未登録\"))","v":""},{"$f":"IF(A101=\"\",\"\",IFERROR(VLOOKUP($A101,Suppliers[],4,0),\"未登録\"))","v":""},{"$f":"IFERROR(VLOOKUP(A101,Suppliers[],8,0),\"\")","v":""},{"$f":"IFERROR(VLOOKUP(A101,Suppliers[],9,0),\"\")","v":""},{"$f":"IFERROR(ROUND(OriginalData[[#This Row],[仕入消費税金額]]/OriginalData[[#This Row],[仕入集計金額]],2),\"\")","v":""},{"$f":"IF(OriginalData[[#This Row],[消費税率]]=0.08,\"K8\",IF(OriginalData[[#This Row],[消費税率]]=0.1,\"AA\",\"\"))","v":""}]
[null,null,null,{"$f":"IF(A102=\"\",\"\",IFERROR(VLOOKUP(A102,Suppliers[],2,0),\"未登録\"))","v":""},{"$f":"IF(A102=\"\",\"\",IFERROR(VLOOKUP($A102,Suppliers[],3,0),\"未登録\"))","v":""},{"$f":"IF(A102=\"\",\"\",IFERROR(VLOOKUP($A102,Suppliers[],4,0),\"未登録\"))","v":""},{"$f":"IFERROR(VLOOKUP(A102,Suppliers[],8,0),\"\")","v":""},{"$f":"IFERROR(VLOOKUP(A102,Suppliers[],9,0),\"\")","v":""},{"$f":"IFERROR(ROUND(OriginalData[[#This Row],[仕入消費税金額]]/OriginalData[[#This Row],[仕入集計金額]],2),\"\")","v":""},{"$f":"IF(OriginalData[[#This Row],[消費税率]]=0.08,\"K8\",IF(OriginalData[[#This Row],[消費税率]]=0.1,\"AA\",\"\"))","v":""}]
[null,null,null,{"$f":"IF(A103=\"\",\"\",IFERROR(VLOOKUP(A103,Suppliers[],2,0),\"未登録\"))","v":""},{"$f":"IF(A103=\"\",\"\",IFERROR(VLOOKUP($A103,Suppliers[],3,0),\"未登録\"))","v":""},{"$f":"IF(A103=\"\",\"\",IFERROR(VLOOKUP($A103,Suppliers[],4,0),\"未登録\"))","v":""},{"$f":"IFERROR(VLOOKUP(A103,Suppliers[],8,0),\"\")","v":""},{"$f":"IFERROR(VLOOKUP(A103,Suppliers[],9,0),\"\")","v":""},{"$f":"IFERROR(ROUND(OriginalData[[#This Row],[仕入消費税金額]]/OriginalData[[#This Row],[仕入集計金額]],2),\"\")","v":""},{"$f":"IF(OriginalData[[#This Row],[消費税率]]=0.08,\"K8\",IF(OriginalData[[#This Row],[消費税率]]=0.1,\"AA\",\"\"))","v":""}]
[null,null,null,{"$f":"IF(A104=\"\",\"\",IFERROR(VLOOKUP(A104,Suppliers[],2,0),\"未登録\"))","v":""},{"$f":"IF(A104=\"\",\"\",IFERROR(VLOOKUP($A104,Suppliers[],3,0),\"未登録\"))","v":""},{"$f":"IF(A104=\"\",\"\",IFERROR(VLOOKUP($A104,Suppliers[],4,0),\"未登録\"))","v":""},{"$f":"IFERROR(VLOOKUP(A104,Suppliers[],8,0),\"\")","v":""},{"$f":"IFERROR(VLOOKUP(A104,Suppliers[],9,0),\"\")","v":""},{"$f":"IFERROR(ROUND(OriginalData[[#This Row],[仕入消費税金額]]/OriginalData[[#This Row],[仕入集計金額]],2),\"\")","v":""},{"$f":"IF(OriginalData[[#This Row],[消費税率]]=0.08,\"K8\",IF(OriginalData[[#This Row],[消費税率]]=0.1,\"AA\",\"\"))","v":""}]
[null,null,null,{"$f":"IF(A105=\"\",\"\",IFERROR(VLOOKUP(A105,Suppliers[],2,0),\"未登録\"))","v":""},{"$f":"IF(A105=\"\",\"\",IFERROR(VLOOKUP($A105,Suppliers[],3,0),\"未登録\"))","v":""},{"$f":"IF(A105=\"\",\"\",IFERROR(VLOOKUP($A105,Suppliers[],4,0),\"未登録\"))","v":""},{"$f":"IFERROR(VLOOKUP(A105,Suppliers[],8,0),\"\")","v":""},{"$f":"IFERROR(VLOOKUP(A105,Suppliers[],9,0),\"\")","v":""},{"$f":"IFERROR(ROUND(OriginalData[[#This Row],[仕入消費税金額]]/OriginalData[[#This Row],[仕入集計金額]],2),\"\")","v":""},{"$f":"IF(OriginalData[[#This Row],[消費税率]]=0.08,\"K8\",IF(OriginalData[[#This Row],[消費税率]]=0.1,\"AA\",\"\"))","v":""}]
[null,null,null,{"$f":"IF(A106=\"\",\"\",IFERROR(VLOOKUP(A106,Suppliers[],2,0),\"未登録\"))","v":""},{"$f":"IF(A106=\"\",\"\",IFERROR(VLOOKUP($A106,Suppliers[],3,0),\"未登録\"))","v":""},{"$f":"IF(A106=\"\",\"\",IFERROR(VLOOKUP($A106,Suppliers[],4,0),\"未登録\"))","v":""},{"$f":"IFERROR(VLOOKUP(A106,Suppliers[],8,0),\"\")","v":""},{"$f":"IFERROR(VLOOKUP(A106,Suppliers[],9,0),\"\")","v":""},{"$f":"IFERROR(ROUND(OriginalData[[#This Row],[仕入消費税金額]]/OriginalData[[#This Row],[仕入集計金額]],2),\"\")","v":""},{"$f":"IF(OriginalData[[#This Row],[消費税率]]=0.08,\"K8\",IF(OriginalData[[#This Row],[消費税率]]=0.1,\"AA\",\"\"))","v":""}]
[null,null,null,{"$f":"IF(A107=\"\",\"\",IFERROR(VLOOKUP(A107,Suppliers[],2,0),\"未登録\"))","v":""},{"$f":"IF(A107=\"\",\"\",IFERROR(VLOOKUP($A107,Suppliers[],3,0),\"未登録\"))","v":""},{"$f":"IF(A107=\"\",\"\",IFERROR(VLOOKUP($A107,Suppliers[],4,0),\"未登録\"))","v":""},{"$f":"IFERROR(VLOOKUP(A107,Suppliers[],8,0),\"\")","v":""},{"$f":"IFERROR(VLOOKUP(A107,Suppliers[],9,0),\"\")","v":""},{"$f":"IFERROR(ROUND(OriginalData[[#This Row],[仕入消費税金額]]/OriginalData[[#This Row],[仕入集計金額]],2),\"\")","v":""},{"$f":"IF(OriginalData[[#This Row],[消費税率]]=0.08,\"K8\",IF(OriginalData[[#This Row],[消費税率]]=0.1,\"AA\",\"\"))","v":""}]
[null,null,null,{"$f":"IF(A108=\"\",\"\",IFERROR(VLOOKUP(A108,Suppliers[],2,0),\"未登録\"))","v":""},{"$f":"IF(A108=\"\",\"\",IFERROR(VLOOKUP($A108,Suppliers[],3,0),\"未登録\"))","v":""},{"$f":"IF(A108=\"\",\"\",IFERROR(VLOOKUP($A108,Suppliers[],4,0),\"未登録\"))","v":""},{"$f":"IFERROR(VLOOKUP(A108,Suppliers[],8,0),\"\")","v":""},{"$f":"IFERROR(VLOOKUP(A108,Suppliers[],9,0),\"\")","v":""},{"$f":"IFERROR(ROUND(OriginalData[[#This Row],[仕入消費税金額]]/OriginalData[[#This Row],[仕入集計金額]],2),\"\")","v":""},{"$f":"IF(OriginalData[[#This Row],[消費税率]]=0.08,\"K8\",IF(OriginalData[[#This Row],[消費税率]]=0.1,\"AA\",\"\"))","v":""}]
[null,null,null,{"$f":"IF(A109=\"\",\"\",IFERROR(VLOOKUP(A109,Suppliers[],2,0),\"未登録\"))","v":""},{"$f":"IF(A109=\"\",\"\",IFERROR(VLOOKUP($A109,Suppliers[],3,0),\"未登録\"))","v":""},{"$f":"IF(A109=\"\",\"\",IFERROR(VLOOKUP($A109,Suppliers[],4,0),\"未登録\"))","v":""},{"$f":"IFERROR(VLOOKUP(A109,Suppliers[],8,0),\"\")","v":""},{"$f":"IFERROR(VLOOKUP(A109,Suppliers[],9,0),\"\")","v":""},{"$f":"IFERROR(ROUND(OriginalData[[#This Row],[仕入消費税金額]]/OriginalData[[#This Row],[仕入集計金額]],2),\"\")","v":""},{"$f":"IF(OriginalData[[#This Row],[消費税率]]=0.08,\"K8\",IF(OriginalData[[#This Row],[消費税率]]=0.1,\"AA\",\"\"))","v":""}]
[null,null,null,{"$f":"IF(A110=\"\",\"\",IFERROR(VLOOKUP(A110,Suppliers[],2,0),\"未登録\"))","v":""},{"$f":"IF(A110=\"\",\"\",IFERROR(VLOOKUP($A110,Suppliers[],3,0),\"未登録\"))","v":""},{"$f":"IF(A110=\"\",\"\",IFERROR(VLOOKUP($A110,Suppliers[],4,0),\"未登録\"))","v":""},{"$f":"IFERROR(VLOOKUP(A110,Suppliers[],8,0),\"\")","v":""},{"$f":"IFERROR(VLOOKUP(A110,Suppliers[],9,0),\"\")","v":""},{"$f":"IFERROR(ROUND(OriginalData[[#This Row],[仕入消費税金額]]/OriginalData[[#This Row],[仕入集計金額]],2),\"\")","v":""},{"$f":"IF(OriginalData[[#This Row],[消費税率]]=0.08,\"K8\",IF(OriginalData[[#This Row],[消費税率]]=0.1,\"AA\",\"\"))","v":""}]
[null,null,null,{"$f":"IF(A111=\"\",\"\",IFERROR(VLOOKUP(A111,Suppliers[],2,0),\"未登録\"))","v":""},{"$f":"IF(A111=\"\",\"\",IFERROR(VLOOKUP($A111,Suppliers[],3,0),\"未登録\"))","v":""},{"$f":"IF(A111=\"\",\"\",IFERROR(VLOOKUP($A111,Suppliers[],4,0),\"未登録\"))","v":""},{"$f":"IFERROR(VLOOKUP(A111,Suppliers[],8,0),\"\")","v":""},{"$f":"IFERROR(VLOOKUP(A111,Suppliers[],9,0),\"\")","v":""},{"$f":"IFERROR(ROUND(OriginalData[[#This Row],[仕入消費税金額]]/OriginalData[[#This Row],[仕入集計金額]],2),\"\")","v":""},{"$f":"IF(OriginalData[[#This Row],[消費税率]]=0.08,\"K8\",IF(OriginalData[[#This Row],[消費税率]]=0.1,\"AA\",\"\"))","v":""}]
[null,null,null,{"$f":"IF(A112=\"\",\"\",IFERROR(VLOOKUP(A112,Suppliers[],2,0),\"未登録\"))","v":""},{"$f":"IF(A112=\"\",\"\",IFERROR(VLOOKUP($A112,Suppliers[],3,0),\"未登録\"))","v":""},{"$f":"IF(A112=\"\",\"\",IFERROR(VLOOKUP($A112,Suppliers[],4,0),\"未登録\"))","v":""},{"$f":"IFERROR(VLOOKUP(A112,Suppliers[],8,0),\"\")","v":""},{"$f":"IFERROR(VLOOKUP(A112,Suppliers[],9,0),\"\")","v":""},{"$f":"IFERROR(ROUND(OriginalData[[#This Row],[仕入消費税金額]]/OriginalData[[#This Row],[仕入集計金額]],2),\"\")","v":""},{"$f":"IF(OriginalData[[#This Row],[消費税率]]=0.08,\"K8\",IF(OriginalData[[#This Row],[消費税率]]=0.1,\"AA\",\"\"))","v":""}]
[null,null,null,{"$f":"IF(A113=\"\",\"\",IFERROR(VLOOKUP(A113,Suppliers[],2,0),\"未登録\"))","v":""},{"$f":"IF(A113=\"\",\"\",IFERROR(VLOOKUP($A113,Suppliers[],3,0),\"未登録\"))","v":""},{"$f":"IF(A113=\"\",\"\",IFERROR(VLOOKUP($A113,Suppliers[],4,0),\"未登録\"))","v":""},{"$f":"IFERROR(VLOOKUP(A113,Suppliers[],8,0),\"\")","v":""},{"$f":"IFERROR(VLOOKUP(A113,Suppliers[],9,0),\"\")","v":""},{"$f":"IFERROR(ROUND(OriginalData[[#This Row],[仕入消費税金額]]/OriginalData[[#This Row],[仕入集計金額]],2),\"\")","v":""},{"$f":"IF(OriginalData[[#This Row],[消費税率]]=0.08,\"K8\",IF(OriginalData[[#This Row],[消費税率]]=0.1,\"AA\",\"\"))","v":""}]
[null,null,null,{"$f":"IF(A114=\"\",\"\",IFERROR(VLOOKUP(A114,Suppliers[],2,0),\"未登録\"))","v":""},{"$f":"IF(A114=\"\",\"\",IFERROR(VLOOKUP($A114,Suppliers[],3,0),\"未登録\"))","v":""},{"$f":"IF(A114=\"\",\"\",IFERROR(VLOOKUP($A114,Suppliers[],4,0),\"未登録\"))","v":""},{"$f":"IFERROR(VLOOKUP(A114,Suppliers[],8,0),\"\")","v":""},{"$f":"IFERROR(VLOOKUP(A114,Suppliers[],9,0),\"\")","v":""},{"$f":"IFERROR(ROUND(OriginalData[[#This Row],[仕入消費税金額]]/OriginalData[[#This Row],[仕入集計金額]],2),\"\")","v":""},{"$f":"IF(OriginalData[[#This Row],[消費税率]]=0.08,\"K8\",IF(OriginalData[[#This Row],[消費税率]]=0.1,\"AA\",\"\"))","v":""}]
[null,null,null,{"$f":"IF(A115=\"\",\"\",IFERROR(VLOOKUP(A115,Suppliers[],2,0),\"未登録\"))","v":""},{"$f":"IF(A115=\"\",\"\",IFERROR(VLOOKUP($A115,Suppliers[],3,0),\"未登録\"))","v":""},{"$f":"IF(A115=\"\",\"\",IFERROR(VLOOKUP($A115,Suppliers[],4,0),\"未登録\"))","v":""},{"$f":"IFERROR(VLOOKUP(A115,Suppliers[],8,0),\"\")","v":""},{"$f":"IFERROR(VLOOKUP(A115,Suppliers[],9,0),\"\")","v":""},{"$f":"IFERROR(ROUND(OriginalData[[#This Row],[仕入消費税金額]]/OriginalData[[#This Row],[仕入集計金額]],2),\"\")","v":""},{"$f":"IF(OriginalData[[#This Row],[消費税率]]=0.08,\"K8\",IF(OriginalData[[#This Row],[消費税率]]=0.1,\"AA\",\"\"))","v":""}]
[null,null,null,{"$f":"IF(A116=\"\",\"\",IFERROR(VLOOKUP(A116,Suppliers[],2,0),\"未登録\"))","v":""},{"$f":"IF(A116=\"\",\"\",IFERROR(VLOOKUP($A116,Suppliers[],3,0),\"未登録\"))","v":""},{"$f":"IF(A116=\"\",\"\",IFERROR(VLOOKUP($A116,Suppliers[],4,0),\"未登録\"))","v":""},{"$f":"IFERROR(VLOOKUP(A116,Suppliers[],8,0),\"\")","v":""},{"$f":"IFERROR(VLOOKUP(A116,Suppliers[],9,0),\"\")","v":""},{"$f":"IFERROR(ROUND(OriginalData[[#This Row],[仕入消費税金額]]/OriginalData[[#This Row],[仕入集計金額]],2),\"\")","v":""},{"$f":"IF(OriginalData[[#This Row],[消費税率]]=0.08,\"K8\",IF(OriginalData[[#This Row],[消費税率]]=0.1,\"AA\",\"\"))","v":""}]
[null,null,null,{"$f":"IF(A117=\"\",\"\",IFERROR(VLOOKUP(A117,Suppliers[],2,0),\"未登録\"))","v":""},{"$f":"IF(A117=\"\",\"\",IFERROR(VLOOKUP($A117,Suppliers[],3,0),\"未登録\"))","v":""},{"$f":"IF(A117=\"\",\"\",IFERROR(VLOOKUP($A117,Suppliers[],4,0),\"未登録\"))","v":""},{"$f":"IFERROR(VLOOKUP(A117,Suppliers[],8,0),\"\")","v":""},{"$f":"IFERROR(VLOOKUP(A117,Suppliers[],9,0),\"\")","v":""},{"$f":"IFERROR(ROUND(OriginalData[[#This Row],[仕入消費税金額]]/OriginalData[[#This Row],[仕入集計金額]],2),\"\")","v":""},{"$f":"IF(OriginalData[[#This Row],[消費税率]]=0.08,\"K8\",IF(OriginalData[[#This Row],[消費税率]]=0.1,\"AA\",\"\"))","v":""}]
[null,null,null,{"$f":"IF(A118=\"\",\"\",IFERROR(VLOOKUP(A118,Suppliers[],2,0),\"未登録\"))","v":""},{"$f":"IF(A118=\"\",\"\",IFERROR(VLOOKUP($A118,Suppliers[],3,0),\"未登録\"))","v":""},{"$f":"IF(A118=\"\",\"\",IFERROR(VLOOKUP($A118,Suppliers[],4,0),\"未登録\"))","v":""},{"$f":"IFERROR(VLOOKUP(A118,Suppliers[],8,0),\"\")","v":""},{"$f":"IFERROR(VLOOKUP(A118,Suppliers[],9,0),\"\")","v":""},{"$f":"IFERROR(ROUND(OriginalData[[#This Row],[仕入消費税金額]]/OriginalData[[#This Row],[仕入集計金額]],2),\"\")","v":""},{"$f":"IF(OriginalData[[#This Row],[消費税率]]=0.08,\"K8\",IF(OriginalData[[#This Row],[消費税率]]=0.1,\"AA\",\"\"))","v":""}]
[null,null,null,{"$f":"IF(A119=\"\",\"\",IFERROR(VLOOKUP(A119,Suppliers[],2,0),\"未登録\"))","v":""},{"$f":"IF(A119=\"\",\"\",IFERROR(VLOOKUP($A119,Suppliers[],3,0),\"未登録\"))","v":""},{"$f":"IF(A119=\"\",\"\",IFERROR(VLOOKUP($A119,Suppliers[],4,0),\"未登録\"))","v":""},{"$f":"IFERROR(VLOOKUP(A119,Suppliers[],8,0),\"\")","v":""},{"$f":"IFERROR(VLOOKUP(A119,Suppliers[],9,0),\"\")","v":""},{"$f":"IFERROR(ROUND(OriginalData[[#This Row],[仕入消費税金額]]/OriginalData[[#This Row],[仕入集計金額]],2),\"\")","v":""},{"$f":"IF(OriginalData[[#This Row],[消費税率]]=0.08,\"K8\",IF(OriginalData[[#This Row],[消費税率]]=0.1,\"AA\",\"\"))","v":""}]
[null,null,null,{"$f":"IF(A120=\"\",\"\",IFERROR(VLOOKUP(A120,Suppliers[],2,0),\"未登録\"))","v":""},{"$f":"IF(A120=\"\",\"\",IFERROR(VLOOKUP($A120,Suppliers[],3,0),\"未登録\"))","v":""},{"$f":"IF(A120=\"\",\"\",IFERROR(VLOOKUP($A120,Suppliers[],4,0),\"未登録\"))","v":""},{"$f":"IFERROR(VLOOKUP(A120,Suppliers[],8,0),\"\")","v":""},{"$f":"IFERROR(VLOOKUP(A120,Suppliers[],9,0),\"\")","v":""},{"$f":"IFERROR(ROUND(OriginalData[[#This Row],[仕入消費税金額]]/OriginalData[[#This Row],[仕入集計金額]],2),\"\")","v":""},{"$f":"IF(OriginalData[[#This Row],[消費税率]]=0.08,\"K8\",IF(OriginalData[[#This Row],[消費税率]]=0.1,\"AA\",\"\"))","v":""}]
[null,null,null,{"$f":"IF(A121=\"\",\"\",IFERROR(VLOOKUP(A121,Suppliers[],2,0),\"未登録\"))","v":""},{"$f":"IF(A121=\"\",\"\",IFERROR(VLOOKUP($A121,Suppliers[],3,0),\"未登録\"))","v":""},{"$f":"IF(A121=\"\",\"\",IFERROR(VLOOKUP($A121,Suppliers[],4,0),\"未登録\"))","v":""},{"$f":"IFERROR(VLOOKUP(A121,Suppliers[],8,0),\"\")","v":""},{"$f":"IFERROR(VLOOKUP(A121,Suppliers[],9,0),\"\")","v":""},{"$f":"IFERROR(ROUND(OriginalData[[#This Row],[仕入消費税金額]]/OriginalData[[#This Row],[仕入集計金額]],2),\"\")","v":""},{"$f":"IF(OriginalData[[#This Row],[消費税率]]=0.08,\"K8\",IF(OriginalData[[#This Row],[消費税率]]=0.1,\"AA\",\"\"))","v":""}]

{"sheet":"BTIN","index":6,"n_rows":333,"n_cols":9,"rows_kept":333,"cut":false,"hidden":true,"merged":[]}
["識別","フラグ","入力項目名","入力値","列","画面項目名",null,"INDEX"]
["P-01",null,null,"一般勘定－明細",null,null,null,"P-01",{"$f":"MATCH(H2,$A:$A,0)+1","v":3}]
[2,null,"RF05A-NEWBS",null,"K","転記キー",null,"P-02",25]
[2,null,"RF05A-NEWKO",null,"L","勘定コード",null,"P-03",52]
[2,"##","BDC_OKCODE","/EPG",null,null,null,"P-04",76]
[1,"##","SAPLF014","0100",null,null,null,"P-05",97]
[2,"##","RF014-VBUND",null,"A","(連結)取引先",null,"P-06",123]
[2,null,"BDC_OKCODE","/00",null,null,null,"P-07",143]
[1,"#","SAPLKACB","0002",null,null,null,"P-08",163]
[2,"#","BDC_OKCODE","/00",null,null,null,"P-09",183]
[1,null,"SAPMF05A","0300",null,null,null,"P-10",208]
[2,null,"BSEG-WRBTR",null,"N","金額",null,"P-11",236]
[2,null,"BSEG-DMBTR",null,"O","国内通貨額",null,"P-12",279]
[2,"X","BSEG-MWSKZ",null,"P","消費税コード",null,"P-13",297]
[2,null,"BSEG-VALUT",null,"V","起算日",null,"P-14",317]
[2,null,"BSEG-ZUONR",null,"T","ソートキー"]
[2,null,"BSEG-SGTXT",null,"U","明細テキスト"]
[2,null,"BDC_OKCODE","/00"]
[1,null,"SAPLKACB","0002"]
[2,null,"COBL-GSBER",null,"Q","事業領域"]
[2,null,"BDC_OKCODE","/00"]
[1,null,"SAPMF05A","0300"]
["eof"]
["P-02",null,null,"原価要素－明細"]
[2,null,"RF05A-NEWBS",null,"K","転記キー"]
[2,null,"RF05A-NEWKO",null,"L","勘定コード"]
[2,"##","BDC_OKCODE","/EPG"]
[1,"##","SAPLF014","0100"]
[2,"##","RF014-VBUND",null,"A","(連結)取引先"]
[2,null,"BDC_OKCODE","/00"]
[1,"#","SAPLKACB","0002"]
[2,"#","BDC_OKCODE","/00"]
[1,null,"SAPMF05A","0300"]
[2,null,"BSEG-WRBTR",null,"N","金額"]
[2,null,"BSEG-DMBTR",null,"O","国内通貨額"]
[2,"X","BSEG-MWSKZ",null,"P","消費税コード"]
[2,null,"BSEG-ZUONR",null,"T","ソートキー"]
[2,null,"BSEG-SGTXT",null,"U","明細テキスト"]
[2,null,"BSEG-MENGE",null,"AD","数量"]
[2,null,"BSEG-MEINS",null,"AE","数量単位"]
[2,null,"BDC_OKCODE","/00"]
[1,null,"SAPLKACB","0002"]
[2,null,"COBL-GSBER",null,"Q","事業領域"]
[2,null,"COBL-KOSTL",null,"R","原価センタ"]
[2,null,"COBL-PRCTR",null,"S","利益センタ"]
[2,null,"COBL-AUFNR",null,"AF","指図書"]
[2,null,"COBL-PS_PSP_PNR",null,"AG","ＷＢＳ要素"]
[2,null,"BDC_OKCODE","/00"]
[1,null,"SAPMF05A","0300"]
["eof"]
["P-03",null,null,"棚卸資産－明細"]
[2,null,"RF05A-NEWBS",null,"K","転記キー"]
[2,null,"RF05A-NEWKO",null,"L","勘定コード"]
[2,"##","BDC_OKCODE","/EPG"]
[1,"##","SAPLF014","0100"]
[2,"##","RF014-VBUND",null,"A","(連結)取引先"]
[2,null,"BDC_OKCODE","/00"]
[1,"#","SAPLKACB","0002"]
[2,"#","BDC_OKCODE","/00"]
[1,null,"SAPMF05A","0300"]
[2,null,"BSEG-WRBTR",null,"N","金額"]
[2,null,"BSEG-DMBTR",null,"O","国内通貨額"]
[2,"X","BSEG-MWSKZ",null,"P","消費税コード"]
[2,null,"BSEG-VALUT",null,"V","起算日"]
[2,null,"BSEG-ZUONR",null,"T","ソートキー"]
[2,null,"BSEG-SGTXT",null,"U","明細テキスト"]
[2,null,"BSEG-MENGE",null,"AD","数量"]
[2,null,"BSEG-MEINS",null,"AE","数量単位"]
[2,null,"BDC_OKCODE","/00"]
[1,null,"SAPLKACB","0002"]
[2,null,"COBL-GSBER",null,"Q","事業領域"]
[2,null,"BDC_OKCODE","/00"]
[1,null,"SAPMF05A","0300"]
["eof"]
["P-04",null,null,"売掛金－明細"]
[2,null,"RF05A-NEWBS",null,"K","転記キー"]
[2,null,"RF05A-NEWKO",null,"L","勘定コード"]
[2,"##","BDC_OKCODE","/EPG"]
[1,"##","SAPLF014","0100"]
[2,"##","RF014-VBUND",null,"A","(連結)取引先"]
[2,null,"BDC_OKCODE","/00"]
[1,"#","SAPLKACB","0002"]
[2,"#","BDC_OKCODE","/00"]
[1,null,"SAPMF05A","0301"]
[2,null,"BSEG-WRBTR",null,"N","金額"]
[2,null,"BSEG-DMBTR",null,"O","国内通貨額"]
[2,null,"BSEG-MWSKZ","**"]
[2,null,"BSEG-GSBER",null,"Q","事業領域"]
[2,null,"BSEG-ZFBDT",null,"W","支払基準日"]
[2,null,"BSEG-ZLSCH",null,"Y","支払方法"]
[2,"*","BSEG-ZTERM",null,null,"支払条件"]
[2,null,"BSEG-ZLSPR",null,"Z","支払保留"]
[2,null,"BSEG-ZUONR",null,"T","ソートキー"]
[2,null,"BSEG-SGTXT",null,"U","明細テキスト"]
["eof"]
["P-05",null,null,"買掛金－明細"]
[2,null,"RF05A-NEWBS",null,"K","転記キー"]
[2,null,"RF05A-NEWKO",null,"L","勘定コード"]
[2,"##","BDC_OKCODE","/EPG"]
[1,"##","SAPLF014","0100"]
[2,"##","RF014-VBUND",null,"A","(連結)取引先"]
[2,null,"BDC_OKCODE","/00"]
[1,"#","SAPLKACB","0002"]
[2,"#","BDC_OKCODE","/00"]
[1,null,"SAPMF05A","0302"]
[2,null,"BSEG-WRBTR",null,"N","金額"]
[2,null,"BSEG-DMBTR",null,"O","国内通貨額"]
[2,null,"BSEG-MWSKZ","**"]
[2,null,"BSEG-GSBER",null,"Q","事業領域"]
[2,null,"BSEG-ZFBDT",null,"W","支払基準日"]
[2,null,"BSEG-ZLSCH",null,"Y","支払方法"]
[2,"*","BSEG-ZTERM",null,null,"支払条件"]
[2,null,"BSEG-ZLSPR",null,"Z","支払保留"]
[2,null,"BSEG-ZUONR",null,"T","ソートキー"]
[2,null,"BSEG-SGTXT",null,"U","明細テキスト"]
[2,null,"BDC_OKCODE","/07"]
[1,null,"SAPMF05A","0332"]
[2,null,"BSEG-BVTYP",null,"AA","取引先銀行"]
[2,null,"BSEG-HBKID",null,"AB","取引銀行"]
[2,null,"BSEG-LZBKZ",null,"AC","中央銀行CD"]
["eof"]
["P-06",null,null,"受取手形－明細"]
[2,null,"RF05A-NEWBS",null,"K","転記キー"]
[2,null,"RF05A-NEWKO",null,"L","勘定コード"]
[2,null,"RF05A-NEWUM",null,"M","特殊G/L"]
[2,"##","BDC_OKCODE","/EPG"]
[1,"##","SAPLF014","0100"]
[2,"##","RF014-VBUND",null,"A","(連結)取引先"]
[2,null,"BDC_OKCODE","/00"]
[1,"#","SAPLKACB","0002"]
[2,"#","BDC_OKCODE","/00"]
[1,null,"SAPMF05A","2320"]
[2,null,"BSEG-WRBTR",null,"N","金額"]
[2,null,"BSEG-DMBTR",null,"O","国内通貨額"]
[2,null,"BSEG-GSBER",null,"Q","事業領域"]
[2,null,"BSEG-ZUONR",null,"T","ソートキー"]
[2,null,"BSEG-SGTXT",null,"U","明細テキスト"]
[2,null,"BSEG-ZFBDT",null,"W","期日"]
[2,null,"BSED-WDATE",null,"X","振出日"]
[2,null,"BSEG-ZLSCH",null,"Y","支払方法"]
["eof"]
["P-07",null,null,"支払手形－明細"]
[2,null,"RF05A-NEWBS",null,"K","転記キー"]
[2,null,"RF05A-NEWKO",null,"L","勘定コード"]
[2,null,"RF05A-NEWUM",null,"M","特殊G/L"]
[2,"##","BDC_OKCODE","/EPG"]
[1,"##","SAPLF014","0100"]
[2,"##","RF014-VBUND",null,"A","(連結)取引先"]
[2,null,"BDC_OKCODE","/00"]
[1,"#","SAPLKACB","0002"]
[2,"#","BDC_OKCODE","/00"]
[1,null,"SAPMF05A","2320"]
[2,null,"BSEG-WRBTR",null,"N","金額"]
[2,null,"BSEG-DMBTR",null,"O","国内通貨額"]
[2,null,"BSEG-GSBER",null,"Q","事業領域"]
[2,null,"BSEG-ZUONR",null,"T","ソートキー"]
[2,null,"BSEG-SGTXT",null,"U","明細テキスト"]
[2,null,"BSEG-ZFBDT",null,"W","期日"]
[2,null,"BSED-WDATE",null,"X","振出日"]
[2,null,"BSEG-ZLSCH",null,"Y","支払方法"]
["eof"]
["P-08",null,null,"得意先(特殊仕訳)－明細"]
[2,null,"RF05A-NEWBS",null,"K","転記キー"]
[2,null,"RF05A-NEWKO",null,"L","勘定コード"]
[2,null,"RF05A-NEWUM",null,"M","特殊G/L"]
[2,"##","BDC_OKCODE","/EPG"]
[1,"##","SAPLF014","0100"]
[2,"##","RF014-VBUND",null,"A","(連結)取引先"]
[2,null,"BDC_OKCODE","/00"]
[1,"#","SAPLKACB","0002"]
[2,"#","BDC_OKCODE","/00"]
[1,null,"SAPMF05A","0303"]
[2,null,"BSEG-WRBTR",null,"N","金額"]
[2,null,"BSEG-DMBTR",null,"O","国内通貨額"]
[2,null,"BSEG-GSBER",null,"Q","事業領域"]
[2,null,"BSEG-ZFBDT",null,"W","期日"]
[2,null,"BSEG-ZLSCH",null,"Y","支払方法"]
[2,null,"BSEG-ZLSPR",null,"Z","支払保留"]
[2,null,"BSEG-ZUONR",null,"T","ソートキー"]
[2,null,"BSEG-SGTXT",null,"U","明細テキスト"]
["eof"]
["P-09",null,null,"仕入先(特殊仕訳)－明細"]
[2,null,"RF05A-NEWBS",null,"K","転記キー"]
[2,null,"RF05A-NEWKO",null,"L","勘定コード"]
[2,null,"RF05A-NEWUM",null,"M","特殊G/L"]
[2,"##","BDC_OKCODE","/EPG"]
[1,"##","SAPLF014","0100"]
[2,"##","RF014-VBUND",null,"A","(連結)取引先"]
[2,null,"BDC_OKCODE","/00"]
[1,"#","SAPLKACB","0002"]
[2,"#","BDC_OKCODE","/00"]
[1,null,"SAPMF05A","0303"]
[2,null,"BSEG-WRBTR",null,"N","金額"]
[2,null,"BSEG-DMBTR",null,"O","国内通貨額"]
[2,null,"BSEG-GSBER",null,"Q","事業領域"]
[2,null,"BSEG-ZFBDT",null,"W","期日"]
[2,null,"BSEG-ZLSCH",null,"Y","支払方法"]
[2,null,"BSEG-ZLSPR",null,"Z","支払保留"]
[2,null,"BSEG-ZUONR",null,"T","ソートキー"]
[2,null,"BSEG-SGTXT",null,"U","明細テキスト"]
[2,null,"BDC_OKCODE","/07"]
[1,null,"SAPMF05A","0332"]
[2,null,"BSEG-BVTYP",null,"AA","取引先銀行"]
[2,null,"BSEG-HBKID",null,"AB","取引銀行"]
[2,null,"BSEG-LZBKZ",null,"AC","中央銀行CD"]
["eof"]
["P-10",null,null,"収益・費用－明細"]
[2,null,"RF05A-NEWBS",null,"K","転記キー"]
[2,null,"RF05A-NEWKO",null,"L","勘定コード"]
[2,"##","BDC_OKCODE","/EPG"]
[1,"##","SAPLF014","0100"]
[2,"##","RF014-VBUND",null,"A","(連結)取引先"]
[2,null,"BDC_OKCODE","/00"]
[1,"#","SAPLKACB","0002"]
[2,"#","BDC_OKCODE","/00"]
[1,null,"SAPMF05A","0300"]
[2,null,"BSEG-WRBTR",null,"N","金額"]
[2,null,"BSEG-DMBTR",null,"O","国内通貨額"]
[2,"X","BSEG-MWSKZ",null,"P","消費税コード"]
[2,null,"BSEG-VALUT",null,"V","起算日"]
[2,null,"BSEG-ZUONR",null,"T","ソートキー"]
[2,null,"BSEG-SGTXT",null,"U","明細テキスト"]
[2,null,"BSEG-MENGE",null,"AD","数量"]
[2,null,"BSEG-MEINS",null,"AE","数量単位"]
[2,null,"BDC_OKCODE","/00"]
[1,null,"SAPLKACB","0002"]
[2,null,"COBL-GSBER",null,"Q","事業領域"]
[2,null,"COBL-KOSTL",null,"R","原価センタ"]
[2,null,"COBL-PRCTR",null,"S","利益センタ"]
[2,null,"COBL-AUFNR",null,"AF","指図書"]
[2,null,"COBL-PS_PSP_PNR",null,"AG","ＷＢＳ要素"]
[2,null,"BDC_OKCODE","/00"]
[1,null,"SAPMF05A","0300"]
["eof"]
["P-11",null,null,"売上・販売直接費－明細(収益性分析）"]
[2,null,"RF05A-NEWBS",null,"K","転記キー"]
[2,null,"RF05A-NEWKO",null,"L","勘定コード"]
[2,"##","BDC_OKCODE","/EPG"]
[1,"##","SAPLF014","0100"]
[2,"##","RF014-VBUND",null,"A","(連結)取引先"]
[2,null,"BDC_OKCODE","/00"]
[1,"#","SAPLKACB","0002"]
[2,"#","BDC_OKCODE","/00"]
[1,null,"SAPMF05A","0300"]
[2,null,"BSEG-WRBTR",null,"N","金額"]
[2,null,"BSEG-DMBTR",null,"O","国内通貨額"]
[2,"X","BSEG-MWSKZ",null,"P","消費税コード"]
[2,null,"BSEG-ZUONR",null,"T","ソートキー"]
[2,null,"BSEG-SGTXT",null,"U","明細テキスト"]
[2,null,"BSEG-MENGE",null,"AD","数量"]
[2,null,"BSEG-MEINS",null,"AE","数量単位"]
[2,null,"BDC_OKCODE","/00"]
[1,null,"SAPLKACB","0002"]
[2,null,"COBL-GSBER",null,"Q","事業領域"]
[2,null,"COBL-KOSTL",null,"R","原価センタ"]
[2,null,"COBL-PRCTR",null,"S","利益センタ"]
[2,null,"COBL-AUFNR",null,"AF","指図書"]
[2,null,"COBL-PS_PSP_PNR",null,"AG","ＷＢＳ要素"]
[2,null,"DKACB-XERGO","X",null,"詳細"]
[2,null,"BDC_OKCODE","/00"]
[1,null,"SAPLKEAK","0300"]
[2,null,"RKEAK-FIELD(1)",null,"AH","得意先コード"]
[2,null,"RKEAK-FIELD(2)",null,"AI","品目コード"]
[2,null,"RKEAK-FIELD(6)",null,"AK","販売組織"]
[2,null,"RKEAK-FIELD(7)",null,"AL","流通チャネル"]
[2,null,"RKEAK-FIELD(8)",null,"AM","製品部門"]
[2,null,"RKEAK-FIELD(15)",null,"AN","品目ｸﾞﾙｰﾌﾟ"]
[2,null,"BDC_OKCODE","P+"]
[1,null,"SAPLKEAK","0300"]
[2,null,"RKEAK-FIELD(2)",null,"AO","営業所"]
[2,null,"RKEAK-FIELD(3)",null,"AP","営業グループ"]
[2,null,"BDC_OKCODE","P+"]
[1,null,"SAPLKEAK","0300"]
[2,null,"RKEAK-FIELD(11)",null,"AQ","需要家"]
[2,null,"BDC_OKCODE","WEIT"]
[1,null,"SAPMF05A","0300"]
["eof"]
["P-12",null,null,"消費税－明細"]
[2,null,"RF05A-NEWBS",null,"K","転記キー"]
[2,null,"RF05A-NEWKO",null,"L","勘定コード"]
[2,"##","BDC_OKCODE","/EPG"]
[1,"##","SAPLF014","0100"]
[2,"##","RF014-VBUND",null,"A","(連結)取引先"]
[2,null,"BDC_OKCODE","/00"]
[1,"#","SAPLKACB","0002"]
[2,"#","BDC_OKCODE","/00"]
[1,null,"SAPMF05A","0312"]
[2,null,"BSEG-WRBTR",null,"N","金額"]
[2,null,"BSEG-DMBTR",null,"O","国内通貨額"]
[2,null,"RF05A-XSTBA","X",null,"課税基準額決定"]
[2,"X","BSEG-MWSKZ",null,"P","消費税コード"]
[2,null,"BSEG-GSBER",null,"Q","事業領域"]
[2,null,"BSEG-ZUONR",null,"T","ソートキー"]
[2,null,"BSEG-SGTXT",null,"U","明細テキスト"]
["eof"]
["P-13",null,null,"得意先(特殊仕訳:前受金･借方)－明細"]
[2,null,"RF05A-NEWBS",null,"K","転記キー"]
[2,null,"RF05A-NEWKO",null,"L","勘定コード"]
[2,null,"RF05A-NEWUM",null,"M","特殊G/L"]
[2,"##","BDC_OKCODE","/EPG"]
[1,"##","SAPLF014","0100"]
[2,"##","RF014-VBUND",null,"A","(連結)取引先"]
[2,null,"BDC_OKCODE","/00"]
[1,"#","SAPLKACB","0002"]
[2,"#","BDC_OKCODE","/00"]
[1,null,"SAPMF05A","0304"]
[2,null,"BSEG-WRBTR",null,"N","金額"]
[2,null,"BSEG-DMBTR",null,"O","国内通貨額"]
[2,null,"BSEG-GSBER",null,"Q","事業領域"]
[2,null,"BSEG-ZFBDT",null,"W","期日"]
[2,null,"BSEG-ZLSCH",null,"Y","支払方法"]
[2,null,"BSEG-ZLSPR",null,"Z","支払保留"]
[2,null,"BSEG-ZUONR",null,"T","ソートキー"]
[2,null,"BSEG-SGTXT",null,"U","明細テキスト"]
["eof"]
["P-14",null,null,"得意先(特殊仕訳:前受金･貸方)－明細"]
[2,null,"RF05A-NEWBS",null,"K","転記キー"]
[2,null,"RF05A-NEWKO",null,"L","勘定コード"]
[2,null,"RF05A-NEWUM",null,"M","特殊G/L"]
[2,"##","BDC_OKCODE","/EPG"]
[1,"##","SAPLF014","0100"]
[2,"##","RF014-VBUND",null,"A","(連結)取引先"]
[2,null,"BDC_OKCODE","/00"]
[1,"#","SAPLKACB","0002"]
[2,"#","BDC_OKCODE","/00"]
[1,null,"SAPMF05A","0304"]
[2,null,"BSEG-WRBTR",null,"N","金額"]
[2,null,"BSEG-DMBTR",null,"O","国内通貨額"]
[2,null,"BSEG-GSBER",null,"Q","事業領域"]
[2,null,"BSEG-ZFBDT",null,"W","期日"]
[2,null,"BSEG-ZUONR",null,"T","ソートキー"]
[2,null,"BSEG-SGTXT",null,"U","明細テキスト"]
["eof"]

{"sheet":"TBL","index":7,"n_rows":58,"n_cols":50,"rows_kept":58,"cut":false,"hidden":true,"merged":[]}
["勘定","行",null,"転記ｷｰ","ﾀｲﾌﾟ","特殊","勘定(開始)","勘定(終了)","ﾊﾟﾀｰﾝ","勘定名",null,null,null,"転記ｷｰ","ﾀｲﾌﾟ","特殊","勘定(開始)","勘定(終了)","ﾊﾟﾀｰﾝ","勘定名",null,null,null,"転記ｷｰ","ﾀｲﾌﾟ","特殊","勘定(開始)","勘定(終了)","ﾊﾟﾀｰﾝ","勘定名",null,null,null,"転記ｷｰ","ﾀｲﾌﾟ","特殊","勘定(開始)","勘定(終了)","ﾊﾟﾀｰﾝ","勘定名",null,null,null,"転記ｷｰ","ﾀｲﾌﾟ","特殊","勘定(開始)","勘定(終了)","ﾊﾟﾀｰﾝ","勘定名"]
[1,2,19,"40/50","Ｓ",null,100010,109999,"P-01"," 現金／預金",null,null,null,"09/19","Ｄ","W",112110,112119,"P-06"," 受取手形",null,null,null,"29/39","Ｋ","W",411100,411100,"P-07"," 支払手形",null,null,null,"21/31","K",null,"412100",412109,"P-05"," 買掛金",null,null,null,"01/11","D",null,"113100",113199,"P-04"," 売掛金"]
[2,20,24,"40/50","Ｓ",null,113999,113999,"P-01"," 売掛金-調整",null,null,null,"09/19","Ｄ","M",145100,145100,"P-08"," 未収入金",null,null,null,"29/39","Ｋ","N",414100,414100,"P-09"," 未払金",null,null,null,"21/31","K",null,415100,415100,"P-09"," 未払費用",null,null,null,"01/11","D",null,113200,113200,"P-04"," 社内売掛金"]
[3,25,28,"40/50","Ｓ",null,"114000",116099,"P-01"," 有価証券／自己株式／預け金",null,null,null,"09/19","Ｄ","X",147101,147101,"P-08"," 営業立替金",null,null,null,"29/39","Ｋ","Q",414300,414300,"P-09"," 未払金（有形固定資産）",null,null,null,"eof",null,null,null,null,null,null,null,null,null,"eof"]
[4,29,39,"40/50","Ｓ",null,"121100",127900,"P-03"," 棚卸資産",null,null,null,"09/19","Ｄ","R",147105,147105,"P-08"," 代理店勘定（債権)",null,null,null,"29/39","Ｋ","R",414400,414400,"P-09"," 未払金（無形固定資産）"]
["5",40,41,"40/50","Ｓ",null,135000,140199,"P-02"," 未成工事",null,null,null,"09/19","Ｄ","S",147107,147107,"P-08"," 海外代理店勘定(債権)",null,null,null,"29/39","Ｋ","K",415100,415100,"P-09"," 未払費用"]
["7",42,43,"40/50","Ｓ",null,"141101",141199,"P-01"," 前渡金",null,null,null,"09/19","Ｄ","T",147109,147109,"P-08"," 関係会社立替金",null,null,null,"29/39","Ｋ","U",418305,418305,"P-09"," 代理店勘定預り金"]
[8,44,51,"40/50","Ｓ",null,"142101",142199,"P-01"," 前払費用",null,null,null,"09/19","Ｄ","Q",411910,411919,"P-08"," 割引手形",null,null,null,"29/39","Ｋ","Y",418307,418307,"P-09"," 海外代理店勘定（債務）"]
["9",52,53,"40/50","Ｓ",null,144100,144199,"P-01"," 短期貸付金",null,null,null,"09/19","Ｄ","U",411920,411929,"P-08"," 譲渡手形",null,null,null,"29/39","Ｋ","V",441011,441011,"P-09"," 仮受金－運賃（特定）"]
["eof",null,null,"40/50","Ｓ",null,145110,145199,"P-01"," 未収入金",null,null,null,"09/19","Ｄ","A","416100","416100","P-13"," 前受金",null,null,null,"eof"]
[null,null,null,"40/50","Ｓ",null,146100,146199,"P-01"," 前渡金",null,null,null,"09/19","Ｄ","C","441000","441000","P-13"," 仮受金-仮受売掛"]
[null,null,null,"40/50","Ｓ",null,147100,147199,"P-01"," 社内立替金",null,null,null,"eof"]
[null,null,null,"40/50","Ｓ",null,147200,147299,"P-01"," 関係会社立替金"]
[null,null,null,"40/50","Ｓ",null,148100,148199,"P-01"," 仮払金"]
[null,null,null,"40/50","Ｓ",null,"148200",148209,"P-12"," 仮払消費税"]
[null,null,null,"40/50","Ｓ",null,"148210","148210","P-01"," 輸入消費税"]
[null,null,null,"40/50","Ｓ",null,"148220",148399,"P-01"," 仮払法人税／仮払利子割"]
[null,null,null,"40/50","Ｓ",null,148500,170999,"P-01"," 立替金／引当金等"]
[]
[null,null,null,"40/50","Ｓ",null,227000,241500,"P-02"," 建設仮勘定"]
[null,null,null,"40/50","Ｓ",null,"261100",262999,"P-01"," 投資有価証券／株式／出資金"]
[null,null,null,"40/50","Ｓ",null,"263500",271099,"P-01"," 長期貸付金(他）"]
[null,null,null,"40/50","Ｓ",null,"281000",292999,"P-01"," 長期前払費用／貸倒引当金"]
[]
[null,null,null,"40/50","Ｓ",null,351000,359999,"P-02"," 生産原価"]
[null,null,null,"40/50","Ｓ",null,361000,361000,"P-02"," 仕入原価"]
[null,null,null,"40/50","Ｓ",null,372001,386400,"P-01"," 事業部勘定勘定"]
[]
[null,null,null,"40/50","Ｓ",null,412999,412999,"P-01"," 買掛金-調整"]
[null,null,null,"40/50","Ｓ",null,"413100",413699,"P-01"," 短期/長期借入金"]
[null,null,null,"40/50","Ｓ",null,414101,415299,"P-01"," 未払金"]
[null,null,null,"40/50","Ｓ",null,416199,416199,"P-01"," 前受金-調整"]
[null,null,null,"40/50","Ｓ",null,"417100",418399,"P-01"," 諸預り金"]
[null,null,null,"40/50","Ｓ",null,"422100",422199,"P-12"," 仮受消費税"]
[null,null,null,"40/50","Ｓ",null,422300,422599,"P-01"," その他流動負債"]
[null,null,null,"40/50","Ｓ",null,441001,441099,"P-01"," 仮受金"]
[null,null,null,"40/50","Ｓ",null,462100,462199,"P-01"," 原価仮勘定"]
[null,null,null,"40/50","Ｓ",null,499000,499000,"P-01"," 在庫初期化"]
[]
[null,null,null,"40/50","Ｓ",null,510000,599999,"P-01"," 長期借入金・引当金関係"]
[]
[null,null,null,"40/50","Ｓ",null,700000,7999999,"P-01"," 資本金"]
[]
[null,null,null,"40/50","Ｓ",null,811100,812999,"P-11"," 売上"]
[null,null,null,"40/50","Ｓ",null,820000,823999,"P-01"," 原価"]
[null,null,null,"40/50","Ｓ",null,824100,827999,"P-02"," 一般管理費"]
[null,null,null,"40/50","Ｓ",null,861000,878399,"P-10"," 受取利息／営業収益／特別利益"]
[null,null,null,"40/50","Ｓ",null,881000,882999,"P-02","支払利息／借入金利息／社債利息"]
[null,null,null,"40/50","Ｓ",null,883400,883599,"P-02"," 原価差額"]
[null,null,null,"40/50","Ｓ",null,884000,886999,"P-02"," 営業外費用／特別損失"]
[]
[null,null,null,"40/50","Ｓ",null,980000,9999999,"P-01"," 税その他"]
[]
[null,null,null,"eof"]
[null,null,null,"　※タイプ(勘定ﾀｲﾌﾟ）・・・Ｓ：勘定コード，Ｄ：得意先コード，Ｋ：仕入先コード"]
[]
["勘定：勘定の最初の一桁"]
["行：開始行"]

{"sheet":"ソートキー管理","index":9,"n_rows":621,"n_cols":8,"rows_kept":621,"cut":false,"hidden":true,"merged":[]}
[]
[null,"取引先\nコード","ソートキー","取引先名称"]
[null,"KO-000002",null,"使用不可三菱東京ＵＦＪ銀行"]
[null,"KO-000003",null,"横浜銀行（本店）"]
[null,"KO-000004",null,"横浜信用金庫（本店）"]
[null,"KO-000005",null,"みずほ銀行（横浜）"]
[null,"KO-000006",null,"三井住友銀行（横浜）"]
[null,"KO-000007",null,"三菱UFJ銀行(横浜中央)"]
[null,"KO-000011",null,"筒井 博"]
[null,"KO-000012",null,"筒井 菊雄"]
[null,"KO-000014",null,"横浜銀行（南部市場）"]
[null,"KO-000021",null,"横浜中税務署"]
[null,"KO-000022",null,"各市 ・ 区役所"]
[null,"KO-000023",null,"金沢区役所"]
[null,"KO-000024",null,"神奈川労働基準局"]
[null,"KO-000025",null,"神奈川県税事務所"]
[null,"KO-000026","日新健保","日新健康保険組合"]
[null,"KO-000027","中社会保険","横浜中社会保険事務所"]
[null,"KO-000028",null,"みずほｲﾝﾍﾞｽﾀｰｽﾞ証券㈱"]
[null,"KO-000029",null,"東金県税事務所"]
[null,"KO-000031",null,"東京ガス"]
[null,"KO-000032",null,"郵便局"]
[null,"KO-000034",null,"原田港湾㈱"]
[null,"KO-000035",null,"千葉県芝山町役場"]
[null,"KO-000036",null,"金沢団地協同組合"]
[null,"KO-000037",null,"東金労働基準監督署"]
[null,"KO-000038",null,"千葉労働局"]
[null,"KO-000039",null,"富里市役所"]
[null,"KO-000040",null,"山武市役所"]
[null,"KO-000100",null,"㈱日新"]
[null,"KO-000201","ｱｻﾋﾈｯﾄ","㈱アサヒネット（ニコス）"]
[null,"KO-000202",null,"浅野段ボール㈱"]
[null,"KO-000203",null,"㈱石森製作所"]
[null,"KO-000204",null,"新千葉カントリー倶楽部"]
[null,"KO-000205",null,"住友生命保険"]
[null,"KO-000206",null,"㈲ｴﾝﾀｰﾌﾟﾗｲｽﾞ野田"]
[null,"KO-000207",null,"喜多村工業㈱"]
[null,"KO-000208",null,"丸新港運㈱"]
[null,"KO-000209",null,"㈱オリックス"]
[null,"KO-000210",null,"日中平和観光㈱"]
[null,"KO-000211",null,"㈱共同貨物運輸"]
[null,"KO-000212",null,"群馬丸太運輸㈱"]
[null,"KO-000213","ｼﾞｬﾊﾟﾝ建材","ジャパン建材㈱"]
[null,"KO-000214",null,"㈱ジェネッツ"]
[null,"KO-000215",null,"㈲　鏡"]
[null,"KO-000216",null,"使用不可 ㈱志正堂","KO-00633ﾘｺｰｿﾘｭｰｼﾞｮﾝｽﾞへ吸収"]
[null,"KO-000217",null,"三菱重工ﾌｫｰｸﾘﾌﾄ販売㈱"]
[null,"KO-000218",null,"㈱ｵｰﾋﾞｯｸｵﾌｨｽｵｰﾄﾒｰｼｮﾝ"]
[null,"KO-000219",null,"㈱高島屋"]
[null,"KO-000220",null,"市原　茂"]
[null,"KO-000221",null,"西武運輸㈱"]
[null,"KO-000222",null,"㈲土屋商店"]
[null,"KO-000223",null,"㈱ﾎﾟｰﾄﾘﾘｰﾌｴﾝｼﾞﾆｱﾘﾝｸﾞ(駐車場）"]
[null,"KO-000224",null,"第一生命保険相互会社"]
[null,"KO-000225","ﾀﾆｯｸｽ","㈱タニックス"]
[null,"KO-000226","東京輸送","㈱東京輸送"]
[null,"KO-000227",null,"㈱コイケ"]
[null,"KO-000228",null,"㈱トーカイ（ＴＯＫＡＩ）"]
[null,"KO-000229","南総通運","南総通運㈱"]
[null,"KO-000230","ｵｰﾋﾞｯｸﾋﾞｼﾞﾈｽｺﾝｻﾙ","㈱ｵｰﾋﾞｯｸﾋﾞｼﾞﾈｽｺﾝｻﾙﾀﾝﾄ"]
[null,"KO-000231","成田ﾄﾞﾗｲｱｲｽ","成田ドライアイス㈱"]
[null,"KO-000232","日本ｵｰﾁｽ","日本ｵｰﾁｽ・ｴﾚﾍﾞｰﾀ㈱"]
[null,"KO-000233",null,"㈱イシカワ"]
[null,"KO-000234","ｼﾞｪｲﾊﾟｯｸ","㈱ジェイパック"]
[null,"KO-000235",null,"㈱オービス"]
[null,"KO-000236",null,"㈱北辰産業"]
[null,"KO-000237",null,"金沢火災予防協会"]
[null,"KO-000238",null,"金沢交通安全協会"]
[null,"KO-000239",null,"横浜中央ﾔｸﾙﾄ販売"]
[null,"KO-000240",null,"横海陸運㈱"]
[null,"KO-000241","大木自動車","大木自動車"]
[null,"KO-000242",null,"使用不可 日本興亜損害保険㈱","社名変更KO-000649へ"]
[null,"KO-000243","ﾄﾖﾀﾌｧｲﾅﾝｽ","トヨタファイナンス㈱"]
[null,"KO-000244",null,"使用不可ニチユMHI東京㈱千葉","社名変更KO-000681へ"]
[null,"KO-000245",null,"日本シーム㈱"]
[null,"KO-000246",null,"㈱ダイニチ"]
[null,"KO-000247",null,"スミセイ損害保険"]
[null,"KO-000248",null,"新日産ﾀﾞｲﾔﾓﾝﾄﾞ工業㈱"]
[null,"KO-000249",null,"使用不可 ㈶結核予防会神奈川県支部","社名変更KO-000563"]
[null,"KO-000250",null,"慶弔会"]
[null,"KO-000251",null,"㈱青和機械"]
[null,"KO-000252","大澤電気管理事務所","大澤電気管理事務所"]
[null,"KO-000253",null,"㈶産業保健協会"]
[null,"KO-000254",null,"㈱ウエノシステック"]
[null,"KO-000255",null,"金子屋金物店"]
[null,"KO-000256","NTTｺﾐｭﾆｹｰｼｮﾝｽﾞ","ＮＴＴコミュニケーションズ"]
[null,"KO-000257","共立","㈱共立"]
[null,"KO-000258",null,"金子　直人"]
[null,"KO-000259",null,"三友プラントサービス㈱"]
[null,"KO-000260",null,"エストロン㈱"]
[null,"KO-000261","小松産業","小松産業㈱"]
[null,"KO-000262","ﾃｨｰｴﾑﾄﾗﾝｽﾎﾟｰﾄ","㈱ティーエムトランスポート"]
[null,"KO-000264","三共","㈱三共"]
[null,"KO-000265","庄司木材","庄司木材㈱"]
[null,"KO-000266",null,"東京ガスライフバル飯田㈱"]
[null,"KO-000267","新港木材工業所","㈱新港木材工業所"]
[null,"KO-000268",null,"㈱シンク・ラボラトリー"]
[null,"KO-000269",null,"春日電設工業㈱"]
[null,"KO-000270",null,"Ｋ．Ｄ．Ｄ．Ｉ"]
[null,"KO-000271",null,"リコー販売㈱　麹町"]
[null,"KO-000272",null,"高木工業㈱"]
[null,"KO-000273","総武ｽﾁﾚﾝ","総武スチレン㈱"]
[null,"KO-000274",null,"㈲ﾃｨｰ･ｴﾑ商会"]
[null,"KO-000275","東京植検","東京植物検疫協会"]
[null,"KO-000276",null,"㈱サンワ企業"]
[null,"KO-000277",null,"日新商事㈱"]
[null,"KO-000278","ﾆｭｰﾗｲﾝ","㈱ニューライン"]
[null,"KO-000279","西野ﾊﾟﾚｯﾄ工業","西野ﾊﾟﾚｯﾄ工業㈱"]
[null,"KO-000280",null,"浜銀ﾌｧｲﾅﾝｽ㈱"]
[null,"KO-000281",null,"野村貿易㈱"]
[null,"KO-000282",null,"フジダン㈱"]
[null,"KO-000283",null,"㈱富士通ﾜｲｴﾌｼｰ"]
[null,"KO-000284",null,"三菱オートリース㈱"]
[null,"KO-000285",null,"ﾊﾟﾅｿﾆｯｸﾛｼﾞｽﾃｯｸｽ㈱"]
[null,"KO-000286","富士物流","富士物流㈱"]
[null,"KO-000287",null,"豊栄港運㈱"]
[null,"KO-000288",null,"㈲繁の鮨"]
[null,"KO-000289",null,"神奈川日産自動車㈱"]
[null,"KO-000290",null,"水口梱包資材㈲"]
[null,"KO-000291",null,"㈱ﾎﾟｰﾄﾘﾘｰﾌｴﾝｼﾞﾆｱﾘﾝｸﾞ(仕入）"]
[null,"KO-000292",null,"㈱ユニマットライフ"]
[null,"KO-000293","山田金作商店","㈱山田金作商店"]
[null,"KO-000294",null,"㈱豊商会"]
[null,"KO-000295",null,"㈱銀泉"]
[null,"KO-000296",null,"あいざわ㈱"]
[null,"KO-000297","相模印刷","相模印刷㈲"]
[null,"KO-000298",null,"㈱なかじま"]
[null,"KO-000299",null,"東京電力"]
[null,"KO-000300",null,"横浜市水道局"]
[null,"KO-000301","NTT東日本","ＮＴＴ東日本"]
[null,"KO-000302","瀬崎林業","瀬崎林業㈱"]
[null,"KO-000303",null,"㈱原田ｴｺﾋﾞｼﾞﾈｽ"]
[null,"KO-000304",null,"使用不可（中）全国木材検査・研究協会","変更KO-000419"]
[null,"KO-000305","ｱｲﾄｽ","㈱アイトス"]
[null,"KO-000306","ｼｬｰﾌﾟﾌｧｲﾅﾝｽ","シャープファイナンス㈱"]
[null,"KO-000307",null,"㈱ベルズ"]
[null,"KO-000308","大和物流","大和物流㈱"]
[null,"KO-000309",null,"日本ベニア㈱"]
[null,"KO-000310",null,"ソニテック㈱"]
[null,"KO-000311","高橋ﾏｰｸ","㈲高橋マーク"]
[null,"KO-000312",null,"日立物流"]
[null,"KO-000313",null,"㈱ﾔﾏｸﾞﾁ"]
[null,"KO-000314",null,"武田電機㈱"]
[null,"KO-000315",null,"㈱ダイヤモンドホテル"]
[null,"KO-000316",null,"使用不可ニチユMHI東京㈱横浜","社名変更KO-000680へ"]
[null,"KO-000317",null,"日新興産㈱"]
[null,"KO-000318","ﾔﾏｼｮｳ","㈱ヤマショウ"]
[null,"KO-000319",null,"㈱群馬総合土地販売"]
[null,"KO-000320",null,"福山通運㈱　横浜南支店"]
[null,"KO-000321",null,"㈲モリヤマ"]
[null,"KO-000322",null,"㈱ｱﾙﾌｧｼｽﾃﾑ ｼﾞｬﾊﾟﾝ"]
[null,"KO-000323","甲陽産業","甲陽産業㈱"]
[null,"KO-000324","ﾛｼﾞｽ･ﾜｰｸｽ","㈱ロジス・ワークス"]
[null,"KO-000325","ｱﾙﾌﾟｽｶｰﾄﾝ","㈱アルプスカートン"]
[null,"KO-000326",null,"使用不可 新和梱包㈱","646と二重登録の為以後この番号は使用しない事"]
[null,"KO-000327",null,"東京ヤクルト販売㈱","石鹸・化粧品　今は使用していない"]
[null,"KO-000328","長島梱包","長島梱包㈱"]
[null,"KO-000329",null,"㈱エイコー（ﾄﾅｰ）"]
[null,"KO-000330",null,"㈲栄進ホーム"]
[null,"KO-000331",null,"ﾊﾟﾅｿﾆｯｸﾎｰﾑｴﾚﾍﾞｰﾀ-㈱"]
[null,"KO-000332",null,"福山通運㈱　成田"]
[null,"KO-000333",null,"㈱コスミック"]
[null,"KO-000334",null,"三陸運輸㈱"]
[null,"KO-000335","大紀工業","大紀工業㈱"]
[null,"KO-000336","ｸﾛﾃｯｸ","㈱クロテック"]
[null,"KO-000337",null,"㈱ﾖｺﾃﾞﾝ"]
[null,"KO-000338","ﾄﾖﾀｴﾙｱﾝﾄﾞｴﾌ千葉","トヨタエルアンドエフ千葉㈱"]
[null,"KO-000339","大倉製作所","㈱大倉製作所"]
[null,"KO-000340",null,"㈱カンザキ"]
[null,"KO-000341","ｶﾝﾀﾞ事務機","㈲カンダ事務機"]
[null,"KO-000342",null,"リコー販売㈱　金沢営業所"]
[null,"KO-000343",null,"リコー販売㈱　成田"]
[null,"KO-000344",null,"ベル・ウッド・ジャパン㈱"]
[null,"KO-000345","ｼﾝｾｲ","㈱シンセイ"]
[null,"KO-000346",null,"Ｎ．Ｈ．Ｋ"]
[null,"KO-000347",null,"㈱紅中"]
[null,"KO-000348","日本ﾊﾟﾚｯﾄﾚﾝﾀﾙ","日本パレットレンタル㈱"]
[null,"KO-000349",null,"ハリマ梱包㈱"]
[null,"KO-000350","浅見工業","浅見工業㈱"]
[null,"KO-000351",null,"㈳日本ｸﾚｰﾝ協会"]
[null,"KO-000352",null,"㈱新開ティ・エス"]
[null,"KO-000353",null,"アコマ医科工業㈱"]
[null,"KO-000354",null,"㈱富士通ｾﾞﾈﾗﾙ情報ｼｽﾃﾑ"]
[null,"KO-000355",null,"ＹＣ杉田　（新聞）"]
[null,"KO-000356","親和ﾊﾟｯｹｰｼﾞ","親和パッケージ㈱"]
[null,"KO-000357",null,"日本管財ｾﾝﾀｰ㈱"]
[null,"KO-000358",null,"㈲佐藤防災商会"]
[null,"KO-000359",null,"㈱ダイトーフジテック"]
[null,"KO-000360","ﾖｺﾊﾏ機工","㈱ヨコハマ機工"]
[null,"KO-000361",null,"東日本梱包管理士会"]
[null,"KO-000362",null,"㈱浜鮨"]
[null,"KO-000363",null,"光ビジネスフォーム㈱"]
[null,"KO-000364",null,"相模運輸倉庫㈱"]
[null,"KO-000365",null,"住友建機販売㈱"]
[null,"KO-000366","ｺｽﾓ化成工業","コスモ化成工業㈱"]
[null,"KO-000367",null,"新和実業㈱"]
[null,"KO-000368","日本機販","日本機販㈱"]
[null,"KO-000369",null,"日新産業㈱"]
[null,"KO-000370","ｹﾝｺｰ","㈱ケンコー"]
[null,"KO-000371",null,"㈱トレードエキスプレス"]
[null,"KO-000372",null,"㈱ﾕｶ"]
[null,"KO-000373",null,"愛知海運㈱"]
[null,"KO-000374",null,"三栄産業㈱"]
[null,"KO-000375",null,"福山通運㈱　横浜金沢営業所"]
[null,"KO-000376","千葉日野自動車","千葉日野自動車㈱"]
[null,"KO-000377",null,"㈱内藤ハウス"]
[null,"KO-000379",null,"㈱ポリシール"]
[null,"KO-000380","日新ｴｱｶｰｺﾞ","日新エアカーゴ㈱"]
[null,"KO-000381",null,"㈱松屋"]
[null,"KO-000382",null,"ﾄﾖﾀﾚﾝﾀﾘｰｽ新千葉"]
[null,"KO-000383",null,"㈱ｺｽﾓ"]
[null,"KO-000384",null,"平和産業運輸㈱"]
[null,"KO-000385",null,"リコーリース㈱"]
[null,"KO-000386",null,"京浜不動産㈱"]
[null,"KO-000387","JCBｺｽﾓ","㈱ＪＣＢコスモ石油"]
[null,"KO-000388",null,"岡田工業㈱"]
[null,"KO-000389",null,"メディカルインスペクションセンター"]
[null,"KO-000390",null,"㈱ﾌｼﾞ物流"]
[null,"KO-000391",null,"大多喜ガス㈱"]
[null,"KO-000392",null,"日新航空ｻｰﾋﾞｽ㈱"]
[null,"KO-000393","ｽﾀｯﾌｻｰﾋﾞｽ","㈱ｽﾀｯﾌｻｰﾋﾞｽ"]
[null,"KO-000394",null,"ＮＴＴ　ＤＯＣＯＭＯ"]
[null,"KO-000395",null,"㈱原伸梱包物流"]
[null,"KO-000396",null,"使用不可 紀州造林㈱","社名変更KO-000666へ"]
[null,"KO-000397",null,"江東ﾊﾟｯｷﾝ工業"]
[null,"KO-000398",null,"山田ダンボール㈱"]
[null,"KO-000399",null,"守谷輸送機工業㈱"]
[null,"KO-000400","大同流通ｻｰﾋﾞｽ","大同流通サービス㈱"]
[null,"KO-000401",null,"㈱ｸﾛｻﾜ"]
[null,"KO-000402",null,"エネオス（ニコス）"]
[null,"KO-000403",null,"ｳｪﾙﾈｯﾄ㈱（ｶｳﾈｯﾄ）"]
[null,"KO-000404",null,"セコム㈱"]
[null,"KO-000405","ｴｲｺｰ","㈱エイコー","年間ｼｽﾃﾑｻﾎﾟｰﾄ保守契約料についてはこちらを使用"]
[null,"KO-000406",null,"本島総合病院"]
[null,"KO-000407",null,"㈲やくしま"]
[null,"KO-000408",null,"横浜ﾀｲﾔﾄﾗｯｸｻｰﾋﾞｽ神奈川㈱"]
[null,"KO-000409",null,"横浜商工会議所"]
[null,"KO-000410",null,"㈳横浜中法人会"]
[null,"KO-000411",null,"リコーテクノシステムズ㈱"]
[null,"KO-000412",null,"㈱エヌ・ワイ・ケイ"]
[null,"KO-000413",null,"（一社） 千葉県木材振興協会"]
[null,"KO-000414",null,"保土ヶ谷ﾛｼﾞｽﾃｨｯｸｽ㈱"]
[null,"KO-000415",null,"㈱山本商会"]
[null,"KO-000416",null,"㈱パシフィックネット"]
[null,"KO-000417",null,"㈱クレックス"]
[null,"KO-000418",null,"㈱ｽﾘｰｴｽ･ｻﾝｷｭｳ"]
[null,"KO-000419",null,"（一社）全国木材検査・研究協会"]
[null,"KO-000420",null,"市原　愛子"]
[null,"KO-000421",null,"NISSIN INTERNATIONAL TRANSPORT U.S.A.INC."]
[null,"KO-000422",null,"㈱愛知日新"]
[null,"KO-000423",null,"㈳日本ｸﾚｰﾝ協会 神奈川県支部"]
[null,"KO-000424",null,"㈱ｼﾞｪｲｱｰﾙ．ﾋﾞｨ"]
[null,"KO-000425",null,"㈲カルーチェ"]
[null,"KO-000426",null,"使用不可 本田木材㈲","株式会社へ社名変更KO-000556によりこちら使用不可"]
[null,"KO-000427",null,"ﾘｺｰｼﾞｬﾊﾟﾝ㈱ 金沢営業所"]
[null,"KO-000428",null,"ﾘｺｰｼﾞｬﾊﾟﾝ㈱ 成田"]
[null,"KO-000429","関東福山通運","関東福山通運㈱ 成田流通ｾﾝﾀｰ"]
[null,"KO-000430",null,"使用不可 ㈱エイコー横浜","ｺﾋﾟｰ機ﾘｰｽ料支払口座、現在使用無の為ｴｲｺｰ処理はKO-000329で処理する事"]
[null,"KO-000431",null,"㈱フジクラ"]
[null,"KO-000432",null,"コーンズドットウェル㈱"]
[null,"KO-000433",null,"LEADER LAST 98 ㈱"]
[null,"KO-000434",null,"使用不可 ニチユMHI東京㈱千葉支店","KO-000244と二重登録に為使用不可"]
[null,"KO-000435",null,"㈲千秋"]
[null,"KO-000436",null,"丸福梱包㈱"]
[null,"KO-000437",null,"㈱TAN"]
[null,"KO-000438",null,"㈶神奈川県予防医学協会"]
[null,"KO-000439",null,"日本飛行機㈱"]
[null,"KO-000440",null,"㈱ サガミ"]
[null,"KO-000441",null,"渡辺組"]
[null,"KO-000442","川島産業","㈲川島産業"]
[null,"KO-000443","ｼﾝｺｰ","㈱ｼﾝｺｰ"]
[null,"KO-000444",null,"使用不可 ㈶太田福島総合病院","社名変更KO-000600により使用不可"]
[null,"KO-000445",null,"三井住友海上火災保険㈱"]
[null,"KO-000446",null,"崎陽軒 本店"]
[null,"KO-000447",null,"㈱ﾏﾙｴｽ"]
[null,"KO-000448",null,"㈱ﾚﾝﾀﾙｶｼﾞｶ"]
[null,"KO-000449",null,"日新会"]
[null,"KO-000450",null,"㈱ｴﾇーｲﾝﾀﾅｼｮﾅﾙ"]
[null,"KO-000451",null,"㈲エイティー"]
[null,"KO-000452",null,"山田医療照明㈱"]
[null,"KO-000453",null,"丸全昭和運輸㈱"]
[null,"KO-000454",null,"三和ｼｬｯﾀｰ工業㈱"]
[null,"KO-000455",null,"㈱ﾀﾞｲﾜｺｰﾎﾟﾚｰｼｮﾝ"]
[null,"KO-000456",null,"文化ｼｬｯﾀｰｻｰﾋﾞｽ㈱"]
[null,"KO-000457",null,"㈱　三　我"]
[null,"KO-000458",null,"SUMIKURA機械㈱"]
[null,"KO-000459",null,"㈱ﾌｼﾞｹﾐｶﾙ"]
[null,"KO-000460",null,"CORNET"]
[null,"KO-000461",null,"デ ル ㈱"]
[null,"KO-000462",null,"㈱川浦興業"]
[null,"KO-000463",null,"ヨコハマテクノス㈱"]
[null,"KO-000464",null,"㈱大越興運"]
[null,"KO-000465",null,"㈲共和包装"]
[null,"KO-000466",null,"中外商事㈱"]
[null,"KO-000467",null,"㈱ﾅｶﾑﾗﾛｼﾞｽﾃｨｸｽ"]
[null,"KO-000468",null,"公共ｼｨｰ･ｱｰﾙ･ｲｰ㈱ 厚木"]
[null,"KO-000469",null,"浦和中央倉庫㈱"]
[null,"KO-000470",null,"㈲栄進ﾎｰﾑ（更新料）"]
[null,"KO-000471",null,"㈱ﾚｵﾊﾟﾚｽ21 川越店（更新料）"]
[null,"KO-000472",null,"富士商工ﾏｼﾅﾘｰ㈱"]
[null,"KO-000473",null,"㈱三共電気商会"]
[null,"KO-000474",null,"ｽｽﾞｺｰ精密㈱"]
[null,"KO-000475",null,"㈱ﾊｻﾞﾜ"]
[null,"KO-000476",null,"佐々木 隆一"]
[null,"KO-000477","ｴｺｸﾞﾘｰﾝ","㈱ｴｺｸﾞﾘｰﾝ"]
[null,"KO-000478","日新商事","日新商事㈱資材"]
[null,"KO-000479",null,"㈱大光産業輸送"]
[null,"KO-000480",null,"㈱小川建機"]
[null,"KO-000481",null,"赤帽ﾀﾞｲﾜ運送"]
[null,"KO-000482",null,"㈱群馬総合土地販売（更新料）"]
[null,"KO-000483",null,"㈱ﾚｵﾊﾟﾚｽ21 足利店"]
[null,"KO-000484",null,"㈲船舶精巧舎"]
[null,"KO-000485",null,"㈱不二美術模型"]
[null,"KO-000486",null,"㈱シーエスシー"]
[null,"KO-000487",null,"江口孔版㈱"]
[null,"KO-000488",null,"ｲｰ･ｴﾌ･ｱｲ㈱"]
[null,"KO-000489",null,"㈲ｱｸﾄ技研"]
[null,"KO-000490",null,"㈱ﾄｰﾏﾝｺｰﾎﾟﾚｰｼｮﾝ"]
[null,"KO-000491",null,"㈱真田製作所"]
[null,"KO-000492",null,"東京電熱計装㈱"]
[null,"KO-000493",null,"大和化学工業㈱"]
[null,"KO-000494",null,"㈱クラナミ"]
[null,"KO-000495","西尾ﾚﾝﾄｵｰﾙ","西尾ﾚﾝﾄｵｰﾙ㈱"]
[null,"KO-000496",null,"品川開発㈱"]
[null,"KO-000497",null,"㈲共進機工"]
[null,"KO-000498",null,"ｱｽｸﾙ（㈱ﾗﾋﾞｯｸｽ）"]
[null,"KO-000499",null,"諸口"]
[null,"KO-000500",null,"㈲弥栄運輸"]
[null,"KO-000501",null,"橋本運輸㈱"]
[null,"KO-000502",null,"東日本港運㈱"]
[null,"KO-000503",null,"㈲ネッツ"]
[null,"KO-000504",null,"河原崎 伸行"]
[null,"KO-000505",null,"所沢市水道課"]
[null,"KO-000506","東京ﾔｸﾙﾄ販売","東京ﾔｸﾙﾄ販売㈱ ﾔｸﾙﾄ本社","お中元・御歳暮で使用（飲料・麺類）"]
[null,"KO-000507","ﾄﾖﾀｴﾙｱﾝﾄﾞｴﾌ","ﾄﾖﾀｴﾙｱﾝﾄﾞｴﾌ神奈川㈱"]
[null,"KO-000508",null,"㈲古倉工務店"]
[null,"KO-000509",null,"㈲ｷｬﾒﾙﾄﾗﾝｽﾎﾟｰﾄｻｰﾋﾞｽ"]
[null,"KO-000510",null,"㈱ﾗﾋﾞｯｸｽ"]
[null,"KO-000511",null,"㈱ｸﾗｸﾏ"]
[null,"KO-000512","JCBｴｸｿﾝ","JCBｴｸｿﾝ"]
[null,"KO-000513",null,"㈱ｵｷﾞﾊﾗ"]
[null,"KO-000514",null,"南総建設㈱"]
[null,"KO-000515",null,"㈱ﾕﾀｶｴﾝｼﾞﾆｱﾘﾝｸﾞ"]
[null,"KO-000516",null,"NPO YSCC 横浜ｽﾎﾟｰﾂ＆ｶﾙﾁｬｰｸﾗﾌﾞ"]
[null,"KO-000517",null,"㈱オチアイ"]
[null,"KO-000518",null,"富士見市水道課"]
[null,"KO-000519",null,"ミクロ電子㈱"]
[null,"KO-000520",null,"司冠栄製作所㈱"]
[null,"KO-000521",null,"日本光機工業㈱"]
[null,"KO-000522",null,"本田商事㈱"]
[null,"KO-000523",null,"東海商事㈱横浜支店"]
[null,"KO-000524",null,"三井倉庫㈱"]
[null,"KO-000525",null,"㈱武蔵商会"]
[null,"KO-000526",null,"大澤電気管理事務所(工事)"]
[null,"KO-000527",null,"㈱キョウワ"]
[null,"KO-000528",null,"㈱トーエル"]
[null,"KO-000529",null,"㈱アクティオ"]
[null,"KO-000530",null,"㈱不二レーベル"]
[null,"KO-000531",null,"東雪運輸㈱"]
[null,"KO-000532",null,"南総通運㈱駐車場"]
[null,"KO-000533",null,"JOMOﾄﾖﾀﾌｧｲﾅﾝｽ"]
[null,"KO-000534",null,"ENEOSﾄﾖﾀﾌｧｲﾅﾝｽ","→部課ｺｰﾄﾞによって変わる","KO-0100　管理部","KO-000534","ｴﾈｵｽﾄﾖﾀF"]
[null,"KO-000535",null,"ﾄﾖﾀL＆F埼玉㈱",null,"KO-0310　横浜工場・管理","KO-000534","TS CUBIC"]
[null,"KO-000536",null,"㈱ｴﾌｴﾑ機興"]
[null,"KO-000537",null,"㈱東上ｾﾚﾓｻｰﾋﾞｽ"]
[null,"KO-000538",null,"㈱ﾔｸﾙﾄ本社"]
[null,"KO-000539",null,"ｶﾈｶﾌｫｰﾑﾌﾟﾗｽﾁｯｸ㈱"]
[null,"KO-000540",null,"日本海運㈱"]
[null,"KO-000541",null,"㈱ 助 友"]
[null,"KO-000542",null,"㈱ティーエフ"]
[null,"KO-000543",null,"㈱ 永 徳"]
[null,"KO-000544",null,"㈱大森廻漕店"]
[null,"KO-000545",null,"㈱ﾕﾆｵﾝｺｰﾎﾟﾚｰｼｮﾝ"]
[null,"KO-000546",null,"㈱日刊木材新聞社"]
[null,"KO-000547",null,"日本熱管工業㈱"]
[null,"KO-000548",null,"ｻﾝﾄﾘｰｻｰﾋﾞｽ㈱"]
[null,"KO-000549",null,"㈱横浜ｴﾝｼﾞﾆｱﾘﾝｸﾞ"]
[null,"KO-000550","ｻﾝﾕｰ印刷","㈱ｻﾝﾕｰ印刷"]
[null,"KO-000551",null,"(医)光陽会 ｻﾝｸﾘﾆｯｸ"]
[null,"KO-000552","NTTF東日本","NTTF ㈱東日本"]
[null,"KO-000553",null,"NTTF ㈱ｺﾐｭﾆｹｰｼｮﾝｽﾞ"]
[null,"KO-000554",null,"NTTF ㈱ ドコモ"]
[null,"KO-000555",null,"富島運輸㈱"]
[null,"KO-000556","本田木材","本田木材㈱"]
[null,"KO-000557",null,"日本ﾍﾟﾌﾟｼｺｰﾗ販売㈱"]
[null,"KO-000558",null,"東日本梱包工業組合"]
[null,"KO-000559",null,"東京電化㈱"]
[null,"KO-000560",null,"㈱ｼｰｴｽｴﾝｼﾞﾆｱﾘﾝｸﾞ"]
[null,"KO-000561",null,"ｳｼｵﾗｲﾃｨﾝｸﾞ㈱"]
[null,"KO-000562",null,"ソーダニッカ㈱"]
[null,"KO-000563","結核予防会","㈶神奈川県結核予防会"]
[null,"KO-000564",null,"㈱神奈川ソイル"]
[null,"KO-000565",null,"㈱今野製作所"]
[null,"KO-000566","ﾏﾌﾞﾁ","㈱マブチ"]
[null,"KO-000567",null,"日本梱包工業組合連合会"]
[null,"KO-000568",null,"マブチ東横パッケージ㈱"]
[null,"KO-000569",null,"㈳神奈川労務安全衛生協会 横浜南"]
[null,"KO-000570",null,"井上工業㈱"]
[null,"KO-000571",null,"㈱ｽｶﾞﾇﾏﾄﾗﾝｽﾎﾟｰﾄ"]
[null,"KO-000572",null,"㈱総合車両製作所"]
[null,"KO-000573",null,"池田　政江"]
[null,"KO-000574",null,"㈲東洋ｽﾁｰﾙ"]
[null,"KO-000575",null,"資源保護㈱"]
[null,"KO-000576",null,"ｺﾏﾂ教習所㈱神奈川ｾﾝﾀｰ"]
[null,"KO-000577",null,"ﾆｼｵﾚﾝﾄｵｰﾙ㈱神奈川"]
[null,"KO-000578",null,"㈱YAMANAKA"]
[null,"KO-000579",null,"住重ﾛｼﾞﾃｯｸ㈱"]
[null,"KO-000580",null,"使用不可 ｻﾝﾄﾘｰﾋﾞﾊﾞﾚｯｼﾞｻｰﾋﾞｽ㈱東京","振込を１本化する為にKO-000584を使用すること"]
[null,"KO-000581",null,"㈱日本運搬社"]
[null,"KO-000582","ｸﾛﾃｯｸ(ACPC)","㈱ｸﾛﾃｯｸ　ACPC"]
[null,"KO-000583","ｱｼﾞｱ油販","ｱｼﾞｱ油販㈱"]
[null,"KO-000584","ｻﾝﾄﾘｰﾋﾞﾊﾞ横浜","ｻﾝﾄﾘｰﾋﾞﾊﾞﾚｯｼﾞｻｰﾋﾞｽ㈱横浜"]
[null,"KO-000585","ﾕﾆﾏｯﾄﾗｲﾌ","㈱ﾕﾆﾏｯﾄﾗｲﾌ 鶴見"]
[null,"KO-000586",null,"㈱ ＲＡＳ"]
[null,"KO-000587",null,"東 海運㈱"]
[null,"KO-000588",null,"司法書士ｱｯﾄ･法務ｵﾌｨｽ 稲葉尚士"]
[null,"KO-000589",null,"京浜不動産㈱ 倉庫"]
[null,"KO-000590","日通ﾄﾗﾝｽﾎﾟｰﾄ","日通ﾄﾗﾝｽﾎﾟｰﾄ㈱ 横浜支店"]
[null,"KO-000591",null,"日新商事㈱ 大阪"]
[null,"KO-000592",null,"㈱ｺﾞｰﾙﾄﾞ･ｽﾀｰ"]
[null,"KO-000593",null,"ﾀｲﾑｽﾞ24㈱"]
[null,"KO-000594",null,"池田 昭（とんかつ いけだ）"]
[null,"KO-000595",null,"高田運輸㈱"]
[null,"KO-000596",null,"神港梱包㈱"]
[null,"KO-000597","萩原 章江(A･ZEN)","萩原 章江(A･ZEN)"]
[null,"KO-000598",null,"大海運輸㈱"]
[null,"KO-000599","平和交通","平和交通㈱"]
[null,"KO-000600",null,"医)明理会 ｲﾑｽ太田中央総合病院"]
[null,"KO-000601",null,"㈱　三　栄"]
[null,"KO-000602",null,"加藤商事㈱"]
[null,"KO-000603",null,"三八五流通㈱"]
[null,"KO-000604",null,"㈲ユーテック"]
[null,"KO-000605",null,"丸田運輸倉庫㈱"]
[null,"KO-000606",null,"永　恒　㈲"]
[null,"KO-000607",null,"㈱久保田建設"]
[null,"KO-000608",null,"和　真"]
[null,"KO-000609",null,"㈲松下梱包"]
[null,"KO-000610",null,"西谷　幸三"]
[null,"KO-000611",null,"極東運輸機工㈱"]
[null,"KO-000612",null,"木村運輸㈱"]
[null,"KO-000613",null,"大和ﾘﾋﾞﾝｸﾞ㈱"]
[null,"KO-000614","東光ｼｽﾃﾑ","東光ｼｽﾃﾑ㈱"]
[null,"KO-000615",null,"㈱ﾄﾗｽﾄﾎﾞﾝﾄﾞ"]
[null,"KO-000616",null,"㈱香名屋ﾄﾚｰﾃﾞｨﾝｸﾞ"]
[null,"KO-000617",null,"佐藤商会(ﾊﾟﾌﾞ淳)"]
[null,"KO-000618",null,"ステーツ"]
[null,"KO-000619",null,"㈱GOOD FRIEND"]
[null,"KO-000620",null,"日本ﾎﾟﾘｼｰﾙ工業㈱"]
[null,"KO-000621",null,"福田産業㈱"]
[null,"KO-000622",null,"ﾏﾙﾅｶﾞﾛｼﾞｽﾃｨｸｽ㈱"]
[null,"KO-000623",null,"長島梱包㈱資材"]
[null,"KO-000624",null,"㈱ＮＳＰ"]
[null,"KO-000625",null,"東屋"]
[null,"KO-000626",null,"㈱二宮総行"]
[null,"KO-000627",null,"ｴﾇｴﾌ･ｼﾞｬﾊﾟﾝ㈱"]
[null,"KO-000628",null,"㈱シスコ"]
[null,"KO-000629",null,"東日本梱包工業組合第三支部"]
[null,"KO-000630",null,"㈱デイリー"]
[null,"KO-000631",null,"㈱シャトル"]
[null,"KO-000632",null,"菅沼運輸㈱"]
[null,"KO-000633","ﾘｺｰｿﾘｭｰｼｮﾝｽﾞ","ﾘｺｰｿﾘｭｰｼｮﾝｽﾞ中央㈱"]
[null,"KO-000634",null,"ｼﾞｬﾊﾟﾝﾎｰﾄﾋﾞｼﾞﾈｽ㈱"]
[null,"KO-000635",null,"㈱ﾈｯﾄﾌﾟﾛﾃｸｼｮﾝｽﾞ"]
[null,"KO-000636",null,"アムール"]
[null,"KO-000637",null,"積和不動産 関東㈱"]
[null,"KO-000638",null,"東日本協同ﾊﾟﾚｯﾄ㈱"]
[null,"KO-000639",null,"㈱住友倉庫"]
[null,"KO-000640","ｱｰﾙ･ｹｰ･ｴｽ","ｱｰﾙ・ｹｰ・ｴｽ㈱"]
[null,"KO-000641",null,"㈱ｶﾞﾘﾊﾞｰｲﾝﾀｰﾅｼｮﾅﾙ"]
[null,"KO-000642","日本梱包資材","日本梱包資材㈱"]
[null,"KO-000643",null,"三工興産㈱"]
[null,"KO-000644",null,"第一ﾘｰｽ㈱"]
[null,"KO-000645",null,"㈱ＯＪＫ"]
[null,"KO-000646",null,"新和梱包㈱"]
[null,"KO-000647",null,"㈱ﾜｰﾙﾄﾞ･ﾜｲﾄﾞ・ﾏｰｹｯﾃｨﾝｸﾞ"]
[null,"KO-000648","ﾔﾏｼﾀ梱包","㈱ﾔﾏｼﾀ梱包"]
[null,"KO-000649",null,"損保ｼﾞｬﾊﾟﾝ日本興亜㈱"]
[null,"KO-000650",null,"ｱﾗﾋﾞｱﾝﾌﾚｰﾄｻｰﾋﾞｽ㈱"]
[null,"KO-000651",null,"十和運送㈱"]
[null,"KO-000652",null,"㈱福井洋樽製作所"]
[null,"KO-000653",null,"横浜ｹﾐｶﾙ㈱"]
[null,"KO-000654",null,"鈴江茂子(ﾏﾀﾞﾑ真樹)"]
[null,"KO-000655",null,"深浦直美(TEN)"]
[null,"KO-000656",null,"佐川急便㈱"]
[null,"KO-000657",null,"㈲山室工業"]
[null,"KO-000658",null,"産業振興㈱"]
[null,"KO-000659",null,"使用不可 ｱｰﾙ・ｹｰ・ｴｽ㈱","640と二重登録の為以後この番号は使用しない事"]
[null,"KO-000660",null,"日本建材㈱"]
[null,"KO-000661",null,"日本ﾛｲﾔﾙ商事㈱"]
[null,"KO-000662",null,"㈱ｵｰﾃｨｰｴｽ"]
[null,"KO-000663","築港","㈱築港"]
[null,"KO-000664",null,"ｴﾇ･ﾕｰ城南物流㈱"]
[null,"KO-000665",null,"使用不可 北越紀州パレット㈱","社名変更によりKO-000696へ こちらは使用不可"]
[null,"KO-000666",null,"東祥㈱"]
[null,"KO-000667",null,"ｾｺﾑﾄﾗｽﾄｼｽﾃﾑｽﾞ㈱"]
[null,"KO-000668",null,"伊藤忠ﾛｼﾞｽﾃｨｸｽ㈱"]
[null,"KO-000669",null,"(医)徳風会 髙根病院"]
[null,"KO-000670",null,"ｻﾝﾄﾘｰﾏｰｹﾃｨﾝｸﾞ&ｺﾏｰｽ㈱"]
[null,"KO-000671",null,"㈱ﾊｳｽ-弐拾壱"]
[null,"KO-000672",null,"三亞通商㈱"]
[null,"KO-000673","ｷﾞｬﾗﾝﾃｨ","GUARANTEE㈱"]
[null,"KO-000674",null,"㈱青葉"]
[null,"KO-000675",null,"三栄ﾒﾝﾃﾅﾝｽ㈱"]
[null,"KO-000676",null,"㈱近鉄ｺｽﾓｽ"]
[null,"KO-000677",null,"ﾛｼﾞｾｽｼﾞｬﾊﾟﾝ㈱"]
[null,"KO-000678",null,"㈱明電舎"]
[null,"KO-000679","ﾜｺｰﾊﾟﾚｯﾄ","㈱ﾜｺｰﾊﾟﾚｯﾄ"]
[null,"KO-000680","ﾛｼﾞｽﾈｸｽﾄ東京横浜","ﾛｼﾞｽﾈｸｽﾄ東京㈱横浜"]
[null,"KO-000681","ﾛｼﾞｽﾈｸｽﾄ東京成田","ﾛｼﾞｽﾈｸｽﾄ東京㈱成田"]
[null,"KO-000682","国際衛生","国際衛生㈱"]
[null,"KO-000683",null,"㈱ｴｯｻﾑ"]
[null,"KO-000684",null,"㈱佐藤船舶"]
[null,"KO-000685",null,"愛知陸運㈱"]
[null,"KO-000686",null,"ﾄﾅﾐ国際物流㈱"]
[null,"KO-000687",null,"ｸﾞﾘｰﾝ・ｺﾝｻﾙﾀﾝﾄ㈱"]
[null,"KO-000688",null,"㈱ｴｰｼｰｸﾘｴｲﾄ"]
[null,"KO-000689","松井工業","㈱松井工業"]
[null,"KO-000690",null,"㈲澤田商運"]
[null,"KO-000691",null,"誠和梱包製箱㈱"]
[null,"KO-000692",null,"㈱ﾔｼﾏｺﾝﾃﾅｻｰﾋﾞｽ"]
[null,"KO-000693",null,"矢島運輸㈱"]
[null,"KO-000694",null,"㈱ﾊﾟｿﾅ ﾊﾟｿﾅｷｬﾘｱｶﾝﾊﾟﾆｰ"]
[null,"KO-000695","田代運輸","㈱田代運輸"]
[null,"KO-000696","北越ﾊﾟﾚｯﾄ","北越パレット㈱"]
[null,"KO-000697","長洲柏戸ｸﾘﾆｯｸ","(一財)柏戸記念財団 長洲柏戸ｸﾘﾆｯｸ"]
[null,"KO-000698","道九運輸","道九運輸㈱"]
[null,"KO-000699",null,"住友建機㈱"]
[null,"KO-000700","ﾓｰﾋﾞﾙｵｰﾄ","ﾓｰﾋﾞﾙｵｰﾄ㈱"]
[null,"KO-000701","横浜ﾍﾞｲｼｪﾗﾄﾝﾎﾃﾙ","横浜ﾍﾞｲｼｪﾗﾄﾝﾎﾃﾙ＆ﾀﾜｰｽﾞ"]
[null,"KO-000702","洛陽出版印刷","洛陽出版印刷"]
[null,"KO-000703","旭商工社","㈱旭商工社"]
[null,"KO-000704","UNﾊﾟｯｸ･ｼﾞｬﾊﾟﾝ","UNﾊﾟｯｸ･ｼﾞｬﾊﾟﾝ㈱"]
[null,"KO-000705","横浜日経社","㈱横浜日経社"]
[null,"KO-000706","ｱﾏﾀﾞﾐﾔﾁ","㈱ｱﾏﾀﾞﾐﾔﾁ"]
[null,"KO-000707","聖隷佐倉市民病院","(福)聖隷福祉事業団 聖隷佐倉市民病院"]
[null,"KO-000708","あおい社労士法人","あおい社会保険労務士法人"]
[null,"KO-000709","山一産業","山一産業㈱"]
[null,"KO-000710","積水ﾊｳｽ","積水ﾊｳｽ不動産東京㈱"]
[null,"KO-000711","大丸松坂屋百貨店","㈱大丸松坂屋百貨店"]
[null,"KO-000712","ﾃｨｰｽﾞﾌｧｸﾄﾘｰ","㈲ﾃｨｰｽﾞﾌｧｸﾄﾘｰ"]
[null,"KO-000713","ﾊﾟﾅｿﾆｯｸ ｴﾚﾍﾞｰﾀｰ","ﾊﾟﾅｿﾆｯｸ ｴﾚﾍﾞｰﾀｰ㈱"]
[null,"KO-000714","太洋機材","太洋機材㈱"]
[]
[]
[]
[]
[]
[]
[]
[]
[]
[null,"KOH000001",null,"環　　 誠"]
[null,"KOH000002",null,"吉野　勲"]
[null,"KOH000110",null,"田中　峻"]
[null,"KOH000112",null,"野見山　幸代"]
[null,"KOH000114",null,"日野原　典子"]
[null,"KOH000115",null,"倉澤　和美"]
[null,"KOH000116",null,"渡辺　弘幸"]
[null,"KOH000117",null,"佐藤　真由美"]
[null,"KOH000118",null,"後藤　直子"]
[null,"KOH000119",null,"関口　和弘"]
[null,"KOH000210",null,"征矢　孝雄"]
[null,"KOH000212",null,"篠崎　良夫"]
[null,"KOH000213",null,"芥川　敦"]
[null,"KOH000215",null,"中川　恵美子"]
[null,"KOH000220",null,"金子　弘美"]
[null,"KOH000221",null,"伊藤　和哉"]
[null,"KOH000312",null,"金子　修司"]
[null,"KOH000313",null,"南雲　実"]
[null,"KOH000314",null,"白井　朱美"]
[null,"KOH000315",null,"黒岩　重好"]
[null,"KOH000316",null,"外濱　忠"]
[null,"KOH000317",null,"川野　謙司"]
[null,"KOH000318",null,"宮崎　聖"]
[null,"KOH000319",null,"蔵永　謙一"]
[null,"KOH000320",null,"河西　勝"]
[null,"KOH000321",null,"山口　賢人"]
[null,"KOH000322",null,"城田　隆行"]
[null,"KOH000323",null,"角田　佳期"]
[null,"KOH000324",null,"山崎　佑馬"]
[null,"KOH000325",null,"清水　哲明"]
[null,"KOH000326",null,"宮崎　聖"]
[null,"KOH000327",null,"小林　理恵子"]
[null,"KOH000410",null,"松永　義久"]
[null,"KOH000412",null,"下村　善亮"]
[null,"KOH000501",null,"佐々木　彦幸"]
[null,"KOH000502",null,"安達　大二朗"]
[null,"KOH000503",null,"青木　良太"]
[null,"KOH000504",null,"大竹　昭浩"]
[null,"KOH000612",null,"石井　勇一"]
[null,"KOH000614",null,"竹田　憲史"]
[null,"KOH000615",null,"坂井　康高"]
[null,"KOH000616",null,"照井　正紀"]
[null,"KOH000650",null,"川田　隆行"]
[null,"KOH000651",null,"埴生　俊介"]
[null,"KOH000652",null,"近藤　眞一　"]
[null,"KOH000653",null,"横山　文太"]
[null,"KOH000654",null,"大林　伸"]
[null,"KOH000655",null,"石川　茂"]
[null,"KOH000657",null,"増田　菜瑠美"]
[null,"KOH000658",null,"伊藤　良"]
[null,"KOH000659",null,"水島　和典"]
[null,"KOH000660",null,"石井　一晃"]
[null,"KOH000711",null,"小川　洋一"]
[null,"KOH000716",null,"下村　令子"]
[null,"KOH000717",null,"森井　豊"]
[null,"KOH000719",null,"押尾　隆"]
[null,"KOH000721",null,"塚本　秀清"]
[null,"KOH000722",null,"藤崎　邦輝"]
[null,"KOH000723",null,"山中　実千代"]
[null,"KOH000724",null,"香取　秀紀"]
[null,"KOH000725",null,"川島　利章"]
[null,"KOH000726",null,"伊藤　芳典"]
[null,"KOH000729",null,"中村　不三男"]
[null,"KOH000730",null,"阿部　浩次"]
[null,"KOH000731",null,"石橋　信也"]
[null,"KOH000732",null,"伊藤　真人"]
[null,"KOH000917",null,"中村　勝利"]
[null,"KOH000950",null,"大門　俊幸"]
[null,"KOH000951",null,"佐藤　廣志"]
[null,"KOH000952",null,"長林　宏一"]